Cocon
type: Concept
preferred label: Cocoon @en
preferred label: Bozzolo @it
preferred label: Capullo (fibra) @es

Fibre animale
type: Concept
preferred label: Fibra animale @it
preferred label: Fibra animal @es
preferred label: Animal fibre @en

Soie du Bombyx du mûrier
type: Concept
preferred label: Seda bombyx mori @es
preferred label: Seta @it
preferred label: Silk bombyx mori @en

Soie sauvage
type: Concept
preferred label: Seta selvatica @it
preferred label: Seda salvaje @es
preferred label: Wild silk @en

Silk Heritage Thesaurus
type: ConceptScheme

Soie de chenille
type: Concept
broader: Fibre animale
narrower: Soie sauvage
narrower: Cocon
narrower: Soie du Bombyx du mûrier
preferred label: Seda @es
preferred label: Séta @it
preferred label: Silk @en
top concept of: Silk Heritage Thesaurus
in scheme: Silk Heritage Thesaurus
bibliographic citation: Villard, Claude. Manuel de théorie du tissage. Tome I. Lyon: A. Rey, 1948, p. 1
bibliographic citation: Treccani online. Accessed 07 september 2020. http://www.treccani.it//vocabolario/versione. @it
bibliographic citation: «Art & Architecture Thesaurus (Getty Research Institute)». Accedido 20 de noviembre de 2018. http://www.getty.edu/research/tools/vocabularies/aat/. @es
bibliographic citation: Centre National de Ressources Textuelles et Lexicales », https://cnrtl.fr/definition/soie
bibliographic citation: Mariella Azzali, Dizionario di costume e moda, dal filo all'abito, Roma, 2015 @it
bibliographic citation: CIETA, Vocabulaire français, Lyon, Centre International d’Etude des Textiles Anciens, 2020, p. 46
bibliographic citation: Jean-Jacques Boucher, Le dictionnaire de la soie : découvrir son histoire de ses origines jusqu'à nos jours, Paris, F. Lanore, 2015, p. 548 et 559
bibliographic citation: Pariset, Ernest. Les industries de la soie, sériciculture, filature, moulinage, tissage, teinture. Histoire et statistique, Lyon: Pitrat aîné, 1862, p. 1-2
bibliographic citation: «Art & Architecture Thesaurus (Getty Research Institute)». Access 9th July 2021. http://www.getty.edu/research/tools/vocabularies/aat/. @en
bibliographic citation: Aniello Gentile, Dizionario etimologico dell'arte tessile, Napoli, 1981 @it
bibliographic citation: E. Bianchi, Dizionario internazionale dei tessuti, Como, 1997 @it
definition: Secreciones y excreciones de fibra proteica, de diversas composiciones, de arañas y diversos insectos. La fibra es utilizada por los animales para hacer capullos, telas, transporte, nidos, para atrapar o conservar presas, entre otros fines. @es
definition: Secretions and excretions of protein fiber, of various compositions, from spiders and various insects. The fiber is used by the animals for cocoons, webs, transportation, nests, to catch or preserve prey, among other purposes. @en
definition: Subst. fém. Du lat. saeta. On donne le nom de soie à la matière secrétée en forme de fil par certains lépidoptères formant la famille des "Bombycides", des "Saturnicides" et des "Psychides", et employée par eux à la construction d'un cocon dans lequel la chenille s'enferme pour se transformer en chrysalide. Une seule race se prête à la domesticité, c'est le "Bombyx Mori" ou "Bombyx du mûrier", désigné ordinairement sous le nom de "ver à soie". L'élevage des chenilles (on disait l'"éducation des vers à soie") a donné naissance à une industrie appelée la "sériciculture". Les "Antheraea du chêne" ont pu être réduit à une semi-domesticité.
definition: s. f. [lat. pop. sēta, class. saeta «setola, crine»]. Fibra di origine animale. In zoologia, nome di secrezioni ed escrezioni di fibra proteica, di varie composizioni, prodotte da diversi animali invertebrati (ragni, pseudoscorpioni, adulti e larve di insetti lepidotteri, ditteri, imenotteri, ecc.) e utilizzate dagli animali stessi per costruire bozzoli per la metamorfosi, nidi e tele per la cattura delle prede. La seta utilizzata storicamente per i manufatti tessili è ricavata dai filamenti di bava solidificata del lepidottero Bombyx mori, comunemente noto col nome di baco da seta. La secrezione di particolari ghiandole dalle quali la sostanza esce, per due orifizî detti filiere, in forma di due bavelle a contatto con l’aria si rapprendono e si saldano tra loro in un filo unico detto bava che serve all'animale per realizzare il bozzolo entro il quale si racchiude per la metamorfosi da larva a farfalla. @it