Indumenti civili
type: Concept
preferred label: Civil attire @en
preferred label: Vêtements civils @fr
preferred label: Indumentaria civil @es

Corredo
type: Concept
broader: Indumenti civili
preferred label: Biens ménagers @fr
preferred label: Ajuar doméstico @es
preferred label: Household goods @en
top concept of: Silk Heritage Thesaurus
in scheme: Silk Heritage Thesaurus
bibliographic citation: «Real Academia Española». Accedido 20 de noviembre de 2018. http://www.rae.es/. @es
bibliographic citation: Treccani online. Accessed 25 July 2020. http://www.treccani.it//vocabolario/versione.
bibliographic citation: G. Sergio, Parole di moda. Il "Corriere delle dame" e il lessico della moda nell'Ottocento, Milano, 2010.
bibliographic citation: A. Donnanno, Modabolario. Parole e immagini della moda. Dizionario tecnico-creativo. Storia del costume tessuti e tessitura tecniche sartoriali accessori e stilisti, Milano, 2018
bibliographic citation: Office québécois d ela langue française, 1993, http://gdt.oqlf.gouv.qc.ca/ficheOqlf.aspx?Id_Fiche=8401646 @fr
definition: It refers to the set of furniture, attires, goods commonly used at domestic context. @en
definition: Conjunto de muebles, enseres y ropas de uso común en la casa. @es
definition: Set di mobili, utensili e vestiti di uso comune in casa spesso facenti parte della dote nuziale della donna.
definition: Loc. masc. pl. Tous les éléments matériels possédés par quelqu'un, utilisés dans le cadre domestique pour l'aménagement, l'entretien, la réparation. @fr

Silk Heritage Thesaurus
type: ConceptScheme