Motivo
type: Concept
preferred label: Motif @en

Motivo alla cinese
type: Concept
broader: Motivo
preferred label: Motif "chinoiserie" @fr
preferred label: Chinoiserie motif @en
preferred label: Motivo chinoiserie @es
top concept of: Silk Heritage Thesaurus
in scheme: Silk Heritage Thesaurus
alternative label: cineseria
bibliographic citation: Carbonell, Antonio, trans. Encyclopedia Metòdica: Fábricas, Artes y Oficios, 2: Fàbricas, Artes y Oficios, Traducidos Del Francés Al Castellano. Imp. de Sancha, 1794. @es
bibliographic citation: F. Pizzato, Tessuti & C. Piccolo dizionario dei termini del mestiere, Milano, 1992
bibliographic citation: Vanessa Alayrac-Fielding (dir.), Rêver la Chine, Tourcoing : Editions invenit, 2017 @fr
bibliographic citation: Geromel Alessandra, Glossario dei termini tecnici, in Indue me Domine. I tessuti liturgici del Museo Diocesano di Brescia, Venezia 1998
bibliographic citation: G. Sergio, Parole di moda. Il "Corriere delle dame" e il lessico della moda nell'Ottocento, Milano, 2010.
bibliographic citation: Dictionnaire de l'Académie française, https://www.dictionnaire-academie.fr/article/A9R2958. @fr
bibliographic citation: Castany Saládrigas, Francisco. Análisis de tejidos. Reconocimiento y análisis de fibras textiles, hilos y tejidos. Barcelona: Gustavo Gil S.A., 1944 @en
bibliographic citation: Bernard Wodon, L'ornement de l'Antiquité au XXe s., Paris : Citadelles & Mazenod, 2014 @fr
bibliographic citation: Maria Teresa Lucidi ( a cura di), Glossario dei termini tecnici occidentali, cinesi e giapponesi, in La seta e la sua via, Roma, 1994
bibliographic citation: A. Donnanno, Modabolario. Parole e immagini della moda. Dizionario tecnico-creativo. Storia del costume tessuti e tessitura tecniche sartoriali accessori e stilisti, Milano, 2018
bibliographic citation: Castany Saládrigas, Francisco. Diccionario de tejidos. Etimología, origen, arte, historia y fabricación de los más importantes tejidos clásicos y modernos. Gustavo Gil S.A., 1949 @es
bibliographic citation: E. Bianchi, Dizionario internazionale dei tessuti, Como, 1997
bibliographic citation: Alain Gruber, Chinoiserie. L'influence de la Chine sur les arts en Europe XVIIe -XIXe s., Bern : Abegg-Stiftung Bern in Riggisberg, 1984 @fr
definition: Elemento ornamental que se insipira en los diseños propios de China, especialmente en flores, vegetales, animales y escenas palaciegas. Se inspira en el estilo chinoiserie de finales del siglo XVII. @es
definition: Ornamental motif inspired by Chinese designs, especially in flowers, vegetables, animals and palatial scenes. It is inspired by the Chinoiserie style of the end of the 17th century. @en
definition: s.m. repertorio molto diffuso nei periodi dei neo stili. Motivo che richiama decori provenienti o che si ispirano alla Cina.
definition: Loc. masc. Motif oriental qui s'inspire de motifs chinois. Ce type de motif a connu son heure de gloire avec la chinoiserie, qui a connu son apogée à la fin du XVIIIe s. @fr

Silk Heritage Thesaurus
type: ConceptScheme