Bue
type: Concept
broader: Tipologia iconografica
preferred label: Ox @en
preferred label: Buey @es
preferred label: Boeuf @fr
top concept of: Silk Heritage Thesaurus
in scheme: Silk Heritage Thesaurus
alternative label: mucca
alternative label: bovino
alternative label: toro
bibliographic citation: «Real Academia Española». Accedido 20 de noviembre de 2018. http://www.rae.es/ @es
bibliographic citation: G. Sergio, Parole di moda. Il "Corriere delle dame" e il lessico della moda nell'Ottocento, Milano, 2010.
bibliographic citation: A. Donnanno, Modabolario. Parole e immagini della moda. Dizionario tecnico-creativo. Storia del costume tessuti e tessitura tecniche sartoriali accessori e stilisti, Milano, 2018
bibliographic citation: Treccani online. Accessed 01 March 2020. http://www.treccani.it//vocabolario/versione
bibliographic citation: James Hall, Dictionnaire des mythes et des symboles, Paris : Gérard Monfort éditeur, 1994 @fr
bibliographic citation: Dictionnaire de l'Académie française, https://www.dictionnaire-academie.fr/article/A9B1452 @fr
bibliographic citation: E. Bianchi, Dizionario internazionale dei tessuti, Como, 1997
bibliographic citation: Maria Teresa Lucidi ( a cura di), Glossario dei termini tecnici occidentali, cinesi e giapponesi, in La seta e la sua via, Roma, 1994
bibliographic citation: Catherine Rager, Dictionnaire des sujets mythologiques, bibliques, hagiographiques et historiques dans l'art, Paris : Brepols, 1994. @fr
bibliographic citation: Simpson, John; Weiner, Edmund (eds). The Oxford English Dictionary. Oxford : Clarendon Press ; Oxford ; New York : Oxford University Press, 1989. [www.oed.com] @en
bibliographic citation: «Art & Architecture Thesaurus (Getty Research Institute)». Accedido 20 de noviembre de 2018. http://www.getty.edu/research/tools/vocabularies/aat/. @es
bibliographic citation: F. Pizzato, Tessuti & C. Piccolo dizionario dei termini del mestiere, Milano, 1992
definition: Del lat. bos, bovis. Macho vacuno castrado. Su significado iconológico es la señal de calma, fortaleza y serenidad. Aparecen relacionados con motivos heráldicos y con la transfiguración cristiana de San Lucas Evangelista como buey. @es
definition: s. m. [lat. bōs bŏvis: v. bove] (pl. buòi). Si riferisce alla rappresentazione del grande mammifero ruminante spesso provvisto di corna, Bos taurus (famiglia Bovidae), a lungo addomesticato per il suo latte, la carne e la pelle.
definition: Subst. masc. Du latin bovem, accusatif de bos, bovis. Mâle adulte de la famille des Bovidés, né du taureau et de la vache, châtré et utilisé pour les travaux des champs ou élevé pour la boucherie. Le boeuf est l'attribut de l'évangéliste Luc. Il est aussi le symbole du sacrifice. C'est aussi un symbole de force et un attribut de la patience. @fr
definition: n. A term inherited from Germanic. From the Old English "oxa" "oxe" and Middle English "ocxe" "oxhe" "nox" among others. It refers to the representation of the large cloven-hoofed, often horned ruminant mammal, Bos taurus (family Bovidae), derived from the extinct Eurasian aurochs and long domesticated for its milk, meat, and hide; a cow, a bull; (in plural) cattle. @en

Tipologia iconografica
type: Concept
preferred label: Tipo iconográfico @es
preferred label: Iconography @en
preferred label: Genre iconographique @fr

animal
type: Collection
member: Bue

depiction
type: Collection
member: animal

Silk Heritage Thesaurus
type: ConceptScheme