Filato d'argento
type: Concept
preferred label: Hilo de plata @es
preferred label: Filé d'argent @fr
preferred label: Silver thread @en

Filo d'argento sottile
type: Concept
broader: Filato d'argento
preferred label: Fil d'argent fin (fil) @fr
preferred label: Medium silver thread @en
preferred label: Hilo de plata fina @es
top concept of: Silk Heritage Thesaurus
in scheme: Silk Heritage Thesaurus
bibliographic citation: Baum, Maggy et Boyeldieu, Chantal. Dictionnaire encyclopédique des textiles. Paris: Eyrolles, 2018, p. 264 @fr
bibliographic citation: F. Pizzato, Tessuti & C. Piccolo dizionario dei termini del mestiere, Milano, 1992
bibliographic citation: E. Bianchi, Dizionario internazionale dei tessuti, Como, 1997
bibliographic citation: G. Sergio, Parole di moda. Il "Corriere delle dame" e il lessico della moda nell'Ottocento, Milano, 2010.
bibliographic citation: Encyclopédie ou Dictionnaire raisonné des sciences, des arts et des métiers par une société de gens de lettres, Diderot, Denis et Le Rond dit D'Alembert, Jean (dir.), Paris : Briasson, David L'aîné, Lebreton, Durand,1751-1772, https://artflsrv03.uchicago.edu/philologic4/encyclopedie1117/navigate/6/2114/?byte=7869156&byte=7869164&byte=7869166 @fr
bibliographic citation: Encyclopédie ou Dictionnaire raisonné des sciences, des arts et des métiers, par une Société de Gens de lettres, https://artflsrv03.uchicago.edu/philologic4/encyclopedie1117/navigate/6/2113/?byte=7866873&byte=7866877&byte=7866879. @es
bibliographic citation: Maria Teresa Lucidi ( a cura di), Glossario dei termini tecnici occidentali, cinesi e giapponesi, in La seta e la sua via, Roma, 1994
bibliographic citation: A. Donnanno, Modabolario. Parole e immagini della moda. Dizionario tecnico-creativo. Storia del costume tessuti e tessitura tecniche sartoriali accessori e stilisti, Milano, 2018
definition: s.m. Si riferisce ad un filo d'argento ottenuto da argento puro 999
definition: It refers to a silver thread obtained from pure silver of 999 thousandths. @en
definition: Loc. masc. Fil de cuivre de couleur rouge, argenté, utilisé par les brodeurs et les passementiers. L'argent fin correspond à 990.000e d'argent pur. @fr
definition: Hilo de plata que se obtiene a partir de la plata pura de 999 milésimas. @es

materials
type: Collection
member: metal thread

metal thread
type: Collection
member: Filo d'argento sottile

Silk Heritage Thesaurus
type: ConceptScheme