Filato d'oro
type: Concept
preferred label: Filé d'or @fr
preferred label: Gold thread @en
preferred label: Hilo de oro @es

Filo d'oro medio
type: Concept
broader: Filato d'oro
preferred label: Hilo oro entrefino @es
preferred label: Medium gold thread @en
preferred label: Fil d'or mi-fin (fil) @fr
top concept of: Silk Heritage Thesaurus
in scheme: Silk Heritage Thesaurus
alternative label: Cuivre argenté doré @fr
bibliographic citation: Encyclopédie ou Dictionnaire raisonné des sciences, des arts et des métiers par une société de gens de lettres, Diderot, Denis et Le Rond dit D'Alembert, Jean (dir.), Paris : Briasson, David L'aîné, Lebreton, Durand,1751-1772, https://artflsrv03.uchicago.edu/philologic4/encyclopedie1117/navigate/6/2113/?byte=7866812&byte=7866816&byte=7866818 @fr
bibliographic citation: Baum, Maggy et Boyeldieu, Chantal. Dictionnaire encyclopédique des textiles. Paris: Eyrolles, 2018, p. 264 @fr
bibliographic citation: F. Pizzato, Tessuti & C. Piccolo dizionario dei termini del mestiere, Milano, 1992
bibliographic citation: E. Bianchi, Dizionario internazionale dei tessuti, Como, 1997
bibliographic citation: G. Sergio, Parole di moda. Il "Corriere delle dame" e il lessico della moda nell'Ottocento, Milano, 2010.
bibliographic citation: A. Donnanno, Modabolario. Parole e immagini della moda. Dizionario tecnico-creativo. Storia del costume tessuti e tessitura tecniche sartoriali accessori e stilisti, Milano, 2018
bibliographic citation: Maria Teresa Lucidi ( a cura di), Glossario dei termini tecnici occidentali, cinesi e giapponesi, in La seta e la sua via, Roma, 1994
bibliographic citation: Espinar Rodríguez, José Mª. “El Bordado en Oro Contemporáneo: Conocimiento de materiales y manufactura de cara a su conservación y difusión.” Trabajo Fin de Grado, Universidad de Sevilla, 2017. Accedido 29 de enero de 2020. https://idus.us.es/bitstream/handle/11441/71902/WAOTFG_103.pdf?sequence=1&isAllowed=y. @es
definition: Loc. masc. Fil de cuivre de couleur rouge, doré, utilisé par les brodeurs et les passementiers. @fr
definition: Hilo con aleación de cobre o con cobre como material predominante, que presenta un baño de oro. @es
definition: s.m. Indica un filo con una lega di rame o con il rame come materiale predominante, che ha una placcatura in oro.
definition: It denotes a thread with a copper alloy or with copper as the predominant material, which has a gold plating. @en

gold thread
type: Collection
member: Filo d'oro medio

materials
type: Collection
member: gold thread

Silk Heritage Thesaurus
type: ConceptScheme