Motivo araldico
type: Concept
preferred label: Motivo heráldico @es
preferred label: Heraldic motif @en
preferred label: Motif héraldique @fr

Stemma
type: Concept
broader: Motivo araldico
preferred label: Badge @en
preferred label: Ecu @fr
preferred label: Escudo @es
top concept of: Silk Heritage Thesaurus
in scheme: Silk Heritage Thesaurus
alternative label: blasone
alternative label: emblem @en
alternative label: escudos @es
alternative label: emblema @es
bibliographic citation: G. Sergio, Parole di moda. Il "Corriere delle dame" e il lessico della moda nell'Ottocento, Milano, 2010.
bibliographic citation: Maria Teresa Lucidi ( a cura di), Glossario dei termini tecnici occidentali, cinesi e giapponesi, in La seta e la sua via, Roma, 1994
bibliographic citation: Treccani online. Accessed 03 March 2020. http://www.treccani.it//vocabolario/versione
bibliographic citation: Simpson, John; Weiner, Edmund (eds). The Oxford English Dictionary. Oxford : Clarendon Press ; Oxford ; New York : Oxford University Press, 1989. [www.oed.com] @en
bibliographic citation: F. Pizzato, Tessuti & C. Piccolo dizionario dei termini del mestiere, Milano, 1992
bibliographic citation: A. Donnanno, Modabolario. Parole e immagini della moda. Dizionario tecnico-creativo. Storia del costume tessuti e tessitura tecniche sartoriali accessori e stilisti, Milano, 2018
bibliographic citation: «Real Academia Española». Accedido 20 de noviembre de 2018. http://www.rae.es/ @es
bibliographic citation: Dictionnaire de l'Académie française, https://www.dictionnaire-academie.fr/article/A9E0386. @fr
bibliographic citation: Fatás, Guillermo, y M. Borrás, Gonzalo. Diccionario de términos de arte y elementos de arqueología, heráldica y numismática. Madrid: Alianza Editorial, 2012 @es
bibliographic citation: E. Bianchi, Dizionario internazionale dei tessuti, Como, 1997
bibliographic citation: Luc Derroitte, Dictionnaire de l'Ornement, Paris : Editions Gisserot, 2012 @fr
definition: s.m. [dal lat. stemma "corona appesa ai busti degli antenati, albero genealogico", gr. stémma "corona"] (pl. -i). - (arald.) complesso figurativo che costituisce il contrassegno di famiglie nobili, istituzioni, enti etc.
definition: n. From an uncertain origin, but related to the Anglo-Norman "bage". The Middle English forms "baggys" "bageous" lately "badg" "bage" "baig" into others. A representation of a heraldic symbol worn as an identifying mark by a knight and his retainers. Lately means any distinctive device, emblem, or mark worn to indicate a person's affiliation, rank, office, name, etc., or membership of an organization or support for a cause. @en
definition: Subst. masc. Du lat. scutum "bouclier". Champ sur lequel figurent des armoiries. Il se présente sous la forle d'un rectangle de sept parties de large sur huit de haut. @fr
definition: Del lat. scutum. Campo, superficie o espacio de distintas formas en que se pintan los blasones de un estado, población, familia, corporación, etc. Los elementos del escudo son: el campo, o superficie del escudo por su interior. En heráldica, el escudo es el elemento central sobre el que se representan las armas. @es

depiction
type: Collection
member: object

object
type: Collection
member: Stemma

Silk Heritage Thesaurus
type: ConceptScheme