Motivo floreale
type: Concept
preferred label: Floral motif @en
preferred label: Motivo floral @es
preferred label: Motif floral @fr

Bocciolo
type: Concept
broader: Motivo floreale
preferred label: Bourgeon @fr
preferred label: Capullo (motivo) @es
preferred label: Coccoon @en
top concept of: Silk Heritage Thesaurus
in scheme: Silk Heritage Thesaurus
bibliographic citation: Treccani online. Accessed 02 March 2020. http://www.treccani.it//vocabolario/versione
bibliographic citation: G. Sergio, Parole di moda. Il "Corriere delle dame" e il lessico della moda nell'Ottocento, Milano, 2010.
bibliographic citation: A. Donnanno, Modabolario. Parole e immagini della moda. Dizionario tecnico-creativo. Storia del costume tessuti e tessitura tecniche sartoriali accessori e stilisti, Milano, 2018
bibliographic citation: «Real Academia Española». Accedido 20 de noviembre de 2018. http://www.rae.es/ @es
bibliographic citation: Maria Teresa Lucidi ( a cura di), Glossario dei termini tecnici occidentali, cinesi e giapponesi, in La seta e la sua via, Roma, 1994
bibliographic citation: Luc Derroitte, Dictionnaire de l'Ornement, Paris : Editions Gisserot, 2012 @fr
bibliographic citation: F. Pizzato, Tessuti & C. Piccolo dizionario dei termini del mestiere, Milano, 1992
bibliographic citation: Dictionnaire de l'Académie française, https://www.dictionnaire-academie.fr/article/A9B1830 @fr
bibliographic citation: E. Bianchi, Dizionario internazionale dei tessuti, Como, 1997
bibliographic citation: Simpson, John; Weiner, Edmund (eds). The Oxford English Dictionary. Oxford : Clarendon Press ; Oxford ; New York : Oxford University Press, 1989. [www.oed.com] @en
definition: s.m. [dim. di boccio]. fiore non ancora schiuso.
definition: n. From the French "cocon", later "coucon", derived from "cocque" that means shell. It refers to the envelope or case of silky threads, but also transferred to similar structures made by other animals, as a covering to enclose them in the chrysalis state. @en
definition: Subst. masc. Du lat. pop. burrio, ‑onis, lui-même dérivé du bas lat. burra 'bourre". Excroissance des végétaux qui renferment des ébauches d'organes, et qui, à leur ouverture, permettra le développement de fleurs, de branches de fleurs. Désigne également un motif floral, entr'ouvert ou fermé qui est très utilisé dans l'architecture à partir du XIIe s. @fr
definition: Quizá de capillo, infl. en su t. por la del lat. cucullus 'capucho'. Puede ser una representación del botón de las flores, especialmente de la rosa. Es la representación de la flor que todavía no ha abierto los pétalos. En tejido, estos motivos aparecen representados a menudo en las composiciones florales. @es

Silk Heritage Thesaurus
type: ConceptScheme