Indumenti civili
type: Concept
preferred label: Civil attire @en
preferred label: Vêtements civils @fr
preferred label: Indumentaria civil @es

Mantello (oggetto)
type: Concept
broader: Q337481
broader: Indumenti civili
preferred label: Mantle @en
preferred label: Manteau (objet) @fr
preferred label: Manto (civil) @es
top concept of: Silk Heritage Thesaurus
in scheme: Silk Heritage Thesaurus
related: Q6752131
bibliographic citation: Maria Teresa Lucidi ( a cura di), Glossario dei termini tecnici occidentali, cinesi e giapponesi, in La seta e la sua via, Roma, 1994
bibliographic citation: Dictionnaire de l'Académie française, https://www.dictionnaire-academie.fr/article/A9M0585 @fr
bibliographic citation: Hervé Pinoteau, La symbolique royale française, Ve-XVIIIe siècles, P.S.R. éditions, 2004. @fr
bibliographic citation: F. Pizzato, Tessuti & C. Piccolo dizionario dei termini del mestiere, Milano, 1992
bibliographic citation: A. Donnanno, Modabolario. Parole e immagini della moda. Dizionario tecnico-creativo. Storia del costume tessuti e tessitura tecniche sartoriali accessori e stilisti, Milano, 2018
bibliographic citation: E. Bianchi, Dizionario internazionale dei tessuti, Como, 1997
bibliographic citation: «Real Academia Española». Accedido 20 de noviembre de 2018. http://www.rae.es/ @es
bibliographic citation: G. Sergio, Parole di moda. Il "Corriere delle dame" e il lessico della moda nell'Ottocento, Milano, 2010.
bibliographic citation: Simpson, John; Weiner, Edmund (eds). The Oxford English Dictionary. Oxford : Clarendon Press ; Oxford ; New York : Oxford University Press, 1989. [www.oed.com]; Stevenson, Angus, ed. Oxford Dictionary of English. 3rd ed. Oxford University Press, 2010. @en
definition: Subst. masc. Issu du lat. mantellum, diminutif de mantum, "manteau". Manteau porté par les empereurs, les rois, les reines ou les princes pour symboliser leur autorité. Lorsqu'ils sont portés lors d'un couronnement, il est appelé "manteau de couronnement". Le manteau est souvent utilisé dans les portraits représentant les monarques et les princes. @fr
definition: n. From Old and Middle English "mentel" "mantal" "mantille" "mantyl". It is, in general, a loose sleeveless and protective garment or blanket with many different uses. @en
definition: s.m. Dal lat. mantum. Indumento maschile e femminile, lungo e ampio, privo di maniche, spesso con cappuccio, che si porta sopra i vestiti, appoggiato sulle spalle e agganciato al collo in modo che ricaschi tutto intorno alla persona e possa drappeggiarsi variamente. Divenne insegna di principi sovrani e cavalieri degli ordini militari.
definition: Del lat. mantum. Rica vestidura de ceremonia, insignia de príncipes soberanos y de caballeros de las órdenes militares, que se ata por encima de los hombros en forma de capa y cubre todo el cuerpo hasta arrastrar por tierra. @es
broad match: Q337481
related match: Q6752131

Silk Heritage Thesaurus
type: ConceptScheme