Punto di legatura
type: Concept
preferred label: Point of binding @en
preferred label: Punto de ligadura @es
preferred label: Point de liage @fr

Riposo
type: Concept
broader: http://vocab.getty.edu/aat/300239669
preferred label: Fil sauté @fr
preferred label: Laissé @en
preferred label: Dejado @es
top concept of: Silk Heritage Thesaurus
in scheme: Silk Heritage Thesaurus
related: Alzata
related: Punto di legatura
bibliographic citation: Casa Aruta, Francisco. Diccionario de la industria textil. Barcelona: Labor, 1969 @es
bibliographic citation: Maria Teresa Lucidi ( a cura di), Glossario dei termini tecnici occidentali, cinesi e giapponesi, in La seta e la sua via, Roma, 1994
bibliographic citation: Aniello Gentile, Dizionario etimologico dell'arte tessile, Napoli, 1981
bibliographic citation: F. Pizzato, Tessuti & C. Piccolo dizionario dei termini del mestiere, Milano, 1992
bibliographic citation: Galcerán Escobet, Vicente. Tecnología del tejido, Tomo primero: teoría de tejidos. Tarrasa: Editograf Pina, 1960. @es
bibliographic citation: A. Donnanno, Modabolario. Parole e immagini della moda. Dizionario tecnico-creativo. Storia del costume tessuti e tessitura tecniche sartoriali accessori e stilisti, Milano, 2018
bibliographic citation: Falcot, Pierre. Traité encyclopédique et méthodique de la fabrication des tissus. Tome 1, Elbeuf: l’auteur, Mulhouse: Risler, 1852, p. 235-236 et 453 @fr
bibliographic citation: Baum, Maggy et Boyeldieu, Chantal. Dictionnaire encyclopédique des textiles. Paris: Eyrolles, 2018, p. 349 @fr
bibliographic citation: Casa Aruta, Francisco. Diccionario de la industria textil. Barcelona: Labor, 1969; Carbonell, Antonio, trans. Encyclopedia Metòdica: Fábricas, Artes y Oficios, 2: Fàbricas, Artes y Oficios, Traducidos Del Francés Al Castellano. Imp. de Sancha, 1794; Galcerán Escobet, Vicente. Tecnología del tejido, Tomo primero: teoría de tejidos. Tarrasa: Editograf Pina, 1960. @en
bibliographic citation: Carbonell, Antonio, trans. Encyclopedia Metòdica: Fábricas, Artes y Oficios, 2: Fàbricas, Artes y Oficios, Traducidos Del Francés Al Castellano. Imp. de Sancha, 1794 @es
bibliographic citation: E. Bianchi, Dizionario internazionale dei tessuti, Como, 1997
bibliographic citation: G. Sergio, Parole di moda. Il "Corriere delle dame" e il lessico della moda nell'Ottocento, Milano, 2010.
definition: It refers to the thread that passes below the pick where it crosses, that is, the weft passes over the warp. In the grid representation of the weaves, the laissé corresponds to the blank boxes. @en
definition: Del part. de dejar. Representa un hilo que pasa por debajo de la pasada en donde se cruza, es decir, la trama pasa por encima de la urdimbre. En la representación en cuadrícula de los ligamentos, el dejado corresponde a los cuadros en blanco. @es
definition: s.m. Nella specifica terminologia della messa in carta indica il quadretto bianco con cui si segnala che l'ordito passa sotto la trama
definition: Subs. masc. Part. passé de laisser. Lors de la "mise en carte" d'un dessin, on colorie les carreaux indiquant le passage de la trame sous la chaîne : les carreaux pleins indiquent les fils de chaîne qui doivent lever lors du passage de la trame, ou, en d'autres termes, que, dans la mise en carte ordinaire, on peint les effets de trame seulement. Cela aura pour effet de percer le "carton jacquard" pour obtenir des "fils pris", et de laisser le carton intact pour obtenir des "fils sautés" ou "laissés". D'après le tracé du croisement, le nom de "sauté" est assigné aux fils toutes les fois qu'ils restent en fond. @fr

Alzata
type: Concept
preferred label: Tomado @es
preferred label: Pris @en
preferred label: Fil pris @fr

Silk Heritage Thesaurus
type: ConceptScheme