Viscosa
type: Concept
preferred label: Viscose @en

Radiado
type: Concept
broader: Ligamento derivado
preferred label: Radiados @it
preferred label: Dice-cloth @en
preferred label: Radiado (motif) @fr
top concept of: Silk Heritage Thesaurus
in scheme: Silk Heritage Thesaurus
related: Viscosa
related: Algodón
related: Laine
bibliographic citation: Castany Saládrigas, Francisco. Diccionario de tejidos. Etimología, origen, arte, historia y fabricación de los más importantes tejidos clásicos y modernos. Gustavo Gil S.A., 1949
bibliographic citation: Castany Saládrigas, Francisco. Diccionario de tejidos. Etimología, origen, arte, historia y fabricación de los más importantes tejidos clásicos y modernos. Gustavo Gil S.A., 1949; Galcerán Escobet, Vicente. Tecnología del tejido, Tomo primero: teoría de tejidos. Tarrasa: Editograf Pina, 1960. @en
bibliographic citation: Galcerán Escobet, Vicente. Tecnología del tejido, Tomo primero: teoría de tejidos. Tarrasa: Editograf Pina, 1960.
definition: Termine che nella specifica bibliografia spagnola individua moduli di disegno circolari e posti in maniera radiale rispetto ad un motivo centrale @it
definition: Del part. de radiar. Los ligamentos radiados se obtienen partiendo de un motivo determinado, dibujándolo, sin modificar, en cuantro posiciones distintas mediante un giro, o dibujándolo, modificado, sin hacerlo girar. En el primer caso los radiados se llaman por rotación y en el segundo por oposición o adamascados.
definition: It refers to the weavings which are obtained on the basis of a specific motif, drawing it, without modifying it, in four different positions by turning, or drawing it, modified, without making it rotate. @en
definition: Subst. masc. pl. Terme espagnol qui identifie des modules de conception circulaires placés radialement par rapport à un motif central. @fr

Algodón
type: Concept
preferred label: Cotton @en
preferred label: Coton @fr
preferred label: Cotone @it

Ligamento derivado
type: Concept
preferred label: Armure dérivée @fr
preferred label: Intreccio derivato @it
preferred label: Derived weave @en

Laine
type: Concept
preferred label: Wool @en
preferred label: Lana

Silk Heritage Thesaurus
type: ConceptScheme