Liccio
type: Concept
preferred label: Shaft @en
preferred label: Lisse @fr
preferred label: Lizo @es

Ordito
type: Concept
preferred label: Warp (yarn) @en
preferred label: Chaîne @fr
preferred label: Urdimbre @es

Orditura
type: Concept
preferred label: Ourdir @fr
preferred label: Warp (technique) @en
preferred label: Urdir @es

Portata
type: Concept
broader: http://vocab.getty.edu/aat/300163707
preferred label: Portée @fr
preferred label: Portee @en
preferred label: Portada @es
top concept of: Silk Heritage Thesaurus
in scheme: Silk Heritage Thesaurus
alternative label: Portée de chaîne @fr
related: Liccio
related: Orditura
related: Ordito
bibliographic citation: F. Pizzato, Tessuti & C. Piccolo dizionario dei termini del mestiere, Milano, 1992
bibliographic citation: Falcot, Pierre. Traité encyclopédique et méthodique de la fabrication des tissus. Tome 1, Elbeuf: l’auteur, Mulhouse: Risler, 1852, p. 47 @fr
bibliographic citation: «Real Academia Española». Accedido 20 de noviembre de 2018. http://www.rae.es/. @es
bibliographic citation: Boucher, Jean-Jacques. Le dictionnaire de la soie: découvrir son histoire de ses origines jusqu’à nos jours. Paris: F. Lanore, 2015, p. 482 @fr
bibliographic citation: Burnham, Dorothy. Warp and Weft. A Textile Terminology. Royal Ontario Museum, 1980. @en
bibliographic citation: Maria Teresa Lucidi ( a cura di), Glossario dei termini tecnici occidentali, cinesi e giapponesi, in La seta e la sua via, Roma, 1994
bibliographic citation: E. Bianchi, Dizionario internazionale dei tessuti, Como, 1997
bibliographic citation: G. Sergio, Parole di moda. Il "Corriere delle dame" e il lessico della moda nell'Ottocento, Milano, 2010.
bibliographic citation: Benito, Pilar. Paraísos de seda. Tejidos y bordados de las casas del Príncipe en los Reales Sitios de El Pardo y El Escorial. València: Universitat de València, 2015 @es
bibliographic citation: A. Donnanno, Modabolario. Parole e immagini della moda. Dizionario tecnico-creativo. Storia del costume tessuti e tessitura tecniche sartoriali accessori e stilisti, Milano, 2018
bibliographic citation: Boy, Jaime. Diccionario teórico, práctico, histórico y geográfico de comercio Vol. I-II-III-IV de la Junta de Comercio de Barcelona. Barcelona: Imprenta Valentín Torrás, 1840. @es
definition: It refers to the carrying together of a group of warp threads in the stretching of a warp. @en
definition: De puerta. Cierto número de hilos de seda que forman una porción de la urdimbre de un tejido. Es un término que se utiliza en la manufactura del tejido. En el caso del terciopelo, las portadas se distinguen entre portadas de pelo y portadas de urdimbre. @es
definition: s.f. Nel linguaggio tessile, ciascuna delle fasi in cui si suddivide l’orditura di una catena d’ordito
definition: Subst. fém. On appelle "portée de chaîne", une réunion de fils servant de base à l'établissement de la chaîne. La portée se compose, à Paris et dans quelques autres villes manufacturières où l'on emploie de grosses matières, de 4o fils, elle est de 80 à Lyon et dans les pays où l'on ne travaille que la soie. Ainsi, quand on dit qu'une chaîné a 95 portées, cela signifie qu'elle est formée de 95 fois 80 fils, tandis que la même expression, dans d'autres villes, signifie que la chaîné est composée de 95 fois 40 fils. Ce qui a donné lieu à cette inégalité de nombres par portées, c'est la différence de grosseur des matières employées dans la confection des étoffes. @fr

Silk Heritage Thesaurus
type: ConceptScheme