Piombo
type: Concept
broader: http://vocab.getty.edu/aat/300247544
preferred label: Plomb @fr
preferred label: Lingo @en
preferred label: Plomo @es
top concept of: Silk Heritage Thesaurus
in scheme: Silk Heritage Thesaurus
alternative label: contrapeso @es
alternative label: peso @es
bibliographic citation: «Art & Architecture Thesaurus (Getty Research Institute)». Accedido 20 de noviembre de 2018. http://www.getty.edu/research/tools/vocabularies/aat/ @es
bibliographic citation: CIETA. Vocabulary of technical terms of fabrics (English, French, Italian, Spanish). Lyon: Centre International d’Etude des Textiles Anciens, 1964; Simpson, John; Weiner, Edmund (eds). The Oxford English Dictionary. Oxford : Clarendon Press ; Oxford ; New York : Oxford University Press, 1989. [www.oed.com]; Burnham, Dorothy. Warp and Weft. A Textile Terminology. Royal Ontario Museum, 1980. @en
bibliographic citation: F. Pizzato, Tessuti & C. Piccolo dizionario dei termini del mestiere, Milano, 1992
bibliographic citation: «Real Academia Española». Accedido 20 de noviembre de 2018. http://www.rae.es/. @es
bibliographic citation: E. Bianchi, Dizionario internazionale dei tessuti, Como, 1997
bibliographic citation: G. Sergio, Parole di moda. Il "Corriere delle dame" e il lessico della moda nell'Ottocento, Milano, 2010.
bibliographic citation: Maria Teresa Lucidi ( a cura di), Glossario dei termini tecnici occidentali, cinesi e giapponesi, in La seta e la sua via, Roma, 1994
bibliographic citation: A. Donnanno, Modabolario. Parole e immagini della moda. Dizionario tecnico-creativo. Storia del costume tessuti e tessitura tecniche sartoriali accessori e stilisti, Milano, 2018
bibliographic citation: Falcot, Pierre. Traité encyclopédique et méthodique de la fabrication des tissus. Tome 1, Elbeuf: l’auteur, Mulhouse: Risler, 1852, p. 196 @fr
bibliographic citation: CIETA Vocabolario tecnico dei tessuti Italiano - Francese - Inglese. Lyon: Centre International d’Etude des Textiles Anciens, 2019
bibliographic citation: CIETA, Guelton, Marie-Hélène et Valansot, Odile (dir.). Vocabulaire technique français Lyon: Centre international d’étude des textiles anciens, 2020, p. 39 @fr
bibliographic citation: CIETA. vocabulario Técnico Tejidos Español, francés, inglés, italiano. Lyon: Centre International d’Etude des Textiles Anciens, 1963 @es
definition: Del lat. plumbum, voz de or. hisp. Barrita de plomo o de hierro suspendida al extremo de una malla para tensar la arcada que la mantiene atada a la cuerda del ramo. @es
definition: Subst. masc. Issu du lat. plumbum. Afin de maintenir une tension convenable aux maillons et aux arcades qui les soutiennent, la maille inférieure supporte un plomb circulaire, allongé en forme d'aiguille, mais régulier dans toute sa longueur. Le poids de ces plombs varie de 5 à 30 grammes, suivant le genre d'étoffes auxquelles ils sont destinés. @fr
definition: n. It might be a borrowing from the Latin "lingua". A historical term that refers to the small weight, typically elongated in shape or made from a length of heavy wire, suspended from the loop or heddle through which each warp end passes, that is, on the lower en of the leash in a drawloom. @en
definition: s.m. Segmento di piombo o di ferro sospeso a un maglione per fare peso e dare tensione all’arcata.

Silk Heritage Thesaurus
type: ConceptScheme