Rovescio
type: Concept
broader: Caratteristiche secondo modifiche del tessuto
preferred label: Envés @es
preferred label: Envers @fr
preferred label: Reverse @en
top concept of: Silk Heritage Thesaurus
in scheme: Silk Heritage Thesaurus
alternative label: reverso @es
bibliographic citation: CIETA, Guelton, Marie-Hélène et Valansot, Odile (dir.). Vocabulaire technique français Lyon: Centre international d’étude des textiles anciens, 2020, p. 16 @fr
bibliographic citation: F. Pizzato, Tessuti & C. Piccolo dizionario dei termini del mestiere, Milano, 1992
bibliographic citation: E. Bianchi, Dizionario internazionale dei tessuti, Como, 1997
bibliographic citation: Mariella Azzali, Dizionario di costume e moda, dal filo all'abito, Roma, 2015
bibliographic citation: Casa Aruta, Francisco. Diccionario de la industria textil. Barcelona: Labor, 1969 @es
bibliographic citation: CIETA. vocabulario Técnico Tejidos Español, francés, inglés, italiano. Lyon: Centre International d’Etude des Textiles Anciens, 1963 @es
bibliographic citation: G. Sergio, Parole di moda. Il "Corriere delle dame" e il lessico della moda nell'Ottocento, Milano, 2010.
bibliographic citation: CIETA. Vocabulary of technical terms of fabrics (English, French, Italian, Spanish). Lyon: Centre International d’Etude des Textiles Anciens, 1964; Tortora, Phyllis, y Ingrid Johnson. The Fairchild Books Dictionary of Textiles, 2015; Simpson, John; Weiner, Edmund (eds). The Oxford English Dictionary. Oxford : Clarendon Press ; Oxford ; New York : Oxford University Press, 1989. [www.oed.com] @en
bibliographic citation: A. Donnanno, Modabolario. Parole e immagini della moda. Dizionario tecnico-creativo. Storia del costume tessuti e tessitura tecniche sartoriali accessori e stilisti, Milano, 2018
bibliographic citation: Falcot, Pierre. Traité encyclopédique et méthodique de la fabrication des tissus. Tome 1, Elbeuf: l’auteur, Mulhouse: Risler, 1852, p. 653 @fr
bibliographic citation: Académie française. « Dictionnaire de l’Académie française », https://www.dictionnaire-academie.fr/article/A9E2040 @fr
bibliographic citation: Maria Teresa Lucidi ( a cura di), Glossario dei termini tecnici occidentali, cinesi e giapponesi, in La seta e la sua via, Roma, 1994
definition: s.m. Lato della tela opposto al diritto, dove è possibile vedere l'intreccio e i fili che contribuiscono agli effetti sul lato definito 'diritto'.
definition: Subst. masc. Du lat. inversus, de invertere, « retourner, renverser ». Désigne la face du tissu opposé à l'endroit, moins belle et qui n'est généralement pas exposée à la vue. @fr
definition: Del lat. inversum. Cara posterior de la tela, lado opuesto al derecho. @es
definition: n. From Anglo-Normal or Middle-French "revers" or English, by conversion, "reuerce". It means the wrong side or back of a fabric or textile. @en

Caratteristiche secondo modifiche del tessuto
type: Concept
preferred label: Textile modifications attributes @en
preferred label: Atributos según las modificaciones de los textiles @es
preferred label: Les erreurs de tissage @fr

Silk Heritage Thesaurus
type: ConceptScheme