Cannellato (aggettivo)
type: Concept
preferred label: côtelé (attribut) @fr
preferred label: Cannele @en
preferred label: Acanalado (atributo) @es

Marezzatura (tecnica)
type: Concept
broader: Tessili classificati in base alla loro finitura
preferred label: Muaré (técnica) @es
preferred label: Moiré (technique) @en
preferred label: Moirage (technique) @fr
top concept of: Silk Heritage Thesaurus
in scheme: Silk Heritage Thesaurus
alternative label: watermaking @en
alternative label: mué @es
alternative label: watered @en
alternative label: moaré @es
alternative label: watering @en
alternative label: muer @es
related: Cannellato (aggettivo)
related: Marezzato (tessuto)
bibliographic citation: CIETA, Guelton, Marie-Hélène et Valansot, Odile (dir.). Vocabulaire technique français Lyon: Centre international d’étude des textiles anciens, 2020, p. 33 @fr
bibliographic citation: Lami, Eugène-Oscar. Dictionnaire encyclopédique et biographique de l'industrie et des arts industriels. Tome 6. Paris: Librairie Des Dictionnaires, 1886, p. 501 @fr
bibliographic citation: «Tesauros - Diccionarios del patrimonio cultural de España - Diccionario de Materias». Accedido 20 de noviembre de 2018. http://tesauros.mecd.es/tesauros/materias.html. @es
bibliographic citation: Castany Saládrigas, Francisco. Diccionario de tejidos. Etimología, origen, arte, historia y fabricación de los más importantes tejidos clásicos y modernos. Gustavo Gil S.A., 1949 @es
bibliographic citation: G. Sergio, Parole di moda. Il "Corriere delle dame" e il lessico della moda nell'Ottocento, Milano, 2010.
bibliographic citation: Hardouin-Fugier, Élisabeth, Berthod, Bernard, Chavent-Fusaro, Martine et Déprez, Camille. Les étoffes : dictionnaire historique. Paris: l’Amateur (1994), 2005, p. 264 @fr
bibliographic citation: E. Bianchi, Dizionario internazionale dei tessuti, Como, 1997
bibliographic citation: Boucher, Jean-Jacques. Le dictionnaire de la soie: découvrir son histoire de ses origines jusqu’à nos jours. Paris: F. Lanore, 2015, p. 408 @fr
bibliographic citation: Pariset, Ernest. Les industries de la soie, sériciculture, filature, moulinage, tissage, teinture. Histoire et statistique, Lyon: Pitrat aîné, 1862, p. 280 @fr
bibliographic citation: Baum, Maggy et Boyeldieu, Chantal. Dictionnaire encyclopédique des textiles. Paris: Eyrolles, 2018, p. 412 @fr
bibliographic citation: A. Donnanno, Modabolario. Parole e immagini della moda. Dizionario tecnico-creativo. Storia del costume tessuti e tessitura tecniche sartoriali accessori e stilisti, Milano, 2018
bibliographic citation: Aniello Gentile, Dizionario etimologico dell'arte tessile, Napoli, 1981
bibliographic citation: F. Pizzato, Tessuti & C. Piccolo dizionario dei termini del mestiere, Milano, 1992
bibliographic citation: Burnham, Dorothy. Warp and Weft. A Textile Terminology. Royal Ontario Museum, 1980; Simpson, John; Weiner, Edmund (eds). The Oxford English Dictionary. Oxford : Clarendon Press ; Oxford ; New York : Oxford University Press, 1989. [www.oed.com]; Tortora, Phyllis, y Ingrid Johnson. The Fairchild Books Dictionary of Textiles, 2015. @en
bibliographic citation: Maria Teresa Lucidi ( a cura di), Glossario dei termini tecnici occidentali, cinesi e giapponesi, in La seta e la sua via, Roma, 1994
definition: Del fr. moiré, este del it. mocaiarro, y este del ár. muẖayyar 'escogido'. La técnica del muaré se obtiene sometiendo al tejido de grano grueso a presión por medio de cilindros grabados con el dibujo a obtener. El resultado es un tejido que da la impresión de hacer aguas. @es
definition: n. From the French "moire", borrowed to English. It defines the technique by which certain ribbed fabrics of cotton, acetate, rayon, silk and some other manufactured fibre fabrics are subjected to heat and pressure with engraved rollers that press the design into the fabric. The difference in reflection of the light from the uncrushed and crushed parts of the design result in the moiré effect. @en
definition: s.f. e P.p. di marezzare, denom. da mare, 'per dipingere a forma di onde marine', col suff. -ezzare di origine settentrionale, per -eggiare. Tecnica di finissaggio che dona effetti di riflesso di luce che si ottengono grazie alla pressione e al movimento rotatorio di una calandra
definition: loc. Masc. De moirer. D’abord écrit mouaire ou moüaire, de l’anglais mohair, lui-même issu de l’arabe mukhayar. Le moirage, procédé mécanique inventé par Tignat en 1843, détermine l'écrasement partiel de la trame qui, perdant sa forme, offre à la lumière de nouvelles surfaces réfléchissantes. On distingue deux sortes d'effets de moirage : l'un appelé "moire antique" est produit par la pression d'une énorme calandre qu'on promène sur le tissu placé préalablement sur des rouleaux : les effets sont dus au hasard et présentent l'aspect de lignes incrustées très brillantes qui s'entrecroisent. L'autre, appelé "moire française" ou "moire ronde", est produit par le passage entre des cylindres chauffés de deux pièces superposées et cousues vers les lisières, qu'on a préalablement fait glisser avec une forte pression sur les dents d'une règle en bois qui ont déterminé des raies qui limitent et arrêtent les effets de moirage : ici les effets sont donc prévus et connus à l'avance. @fr

Marezzato (tessuto)
type: Concept
preferred label: Moire (tissu) @fr
preferred label: Moiré (fabric) @en
preferred label: Muaré (tejido) @es

other technique
type: Collection
member: Marezzatura (tecnica)

techniques
type: Collection
member: other technique

Silk Heritage Thesaurus
type: ConceptScheme

Tessili classificati in base alla loro finitura
type: Concept
preferred label: Técnica de tejido según acabado @es
preferred label: Apprêt du tissu (technique) @fr
preferred label: Weaving technique according to finish @en