Filo di seta cruda
type: Concept
broader: Filo secondo il materiale di cui è composto
preferred label: Undyed thread @en
preferred label: Hilo crudo @es
preferred label: Fil grège (fil) @fr
top concept of: Silk Heritage Thesaurus
in scheme: Silk Heritage Thesaurus
alternative label: seta tratta
bibliographic citation: « Centre National de Ressources Textuelles et Lexicales », https://cnrtl.fr/definition/gr%C3%A8ge @fr
bibliographic citation: F. Pizzato, Tessuti & C. Piccolo dizionario dei termini del mestiere, Milano, 1992
bibliographic citation: Dávila Corona, RosaDuran i Pujol, Montserrat, y García Fernández, Máximo. Diccionario histórico de telas y tejidos castellano-catalán. Salamanca: Junta de Castilla y León, 2004 @es
bibliographic citation: Pariset, Ernest. Les industries de la soie, sériciculture, filature, moulinage, tissage, teinture. Histoire et statistique, Lyon: Pitrat aîné, 1862, p. 87-112 @fr
bibliographic citation: Boucher, Jean-Jacques. Le dictionnaire de la soie: découvrir son histoire de ses origines jusqu’à nos jours. Paris: F. Lanore, 2015, p. 277 @fr
bibliographic citation: Maria Teresa Lucidi ( a cura di), Glossario dei termini tecnici occidentali, cinesi e giapponesi, in La seta e la sua via, Roma, 1994
bibliographic citation: Cervera i Caminal, Anna, Mumbrú i Laporta,Josep, Pont i Puntigam, M. Rosa, Taló i Rovira, Joan. Diccionari de la indústria tèxtil. Català, Castellà, Francés, Anglés i Alemany. Barcelona: Universitat Politècnica de Catalunya: Servei de llengües i terminologia de la UPC, s. f @es
bibliographic citation: G. Sergio, Parole di moda. Il "Corriere delle dame" e il lessico della moda nell'Ottocento, Milano, 2010.
bibliographic citation: CIETA, Guelton, Marie-Hélène et Valansot, Odile (dir.). Vocabulaire technique français Lyon: Centre international d’étude des textiles anciens, 2020, p. 15, 83 @fr
bibliographic citation: Académie française. « Dictionnaire de l’Académie française », https://www.dictionnaire-academie.fr/article/A9G1389 @fr
bibliographic citation: CIETA Vocabolario tecnico dei tessuti Italiano - Francese - Inglese. Lyon: Centre International d’Etude des Textiles Anciens, 2019
bibliographic citation: Gürtler, Max, and W. Kind. La Industria Textil. Barcelona: Editorial Labor, S.A., 1930 @es
bibliographic citation: Burnham, Dorothy. Warp and Weft. A Textile Terminology. Royal Ontario Museum, 1980 @en
bibliographic citation: E. Bianchi, Dizionario internazionale dei tessuti, Como, 1997
bibliographic citation: A. Donnanno, Modabolario. Parole e immagini della moda. Dizionario tecnico-creativo. Storia del costume tessuti e tessitura tecniche sartoriali accessori e stilisti, Milano, 2018
bibliographic citation: Clavairolle, Françoise. Sériciculture en Cévennes, Essai d'anthropologie historique et sociale sur la dynamique des savoirs et de la production. Thèse d'ethnologie. Paris: EHESS, 1997, p. 535 @fr
definition: El que no ha sufrido ninguna operación de lavado, tinte o blanqueo. @es
definition: Dicesi di un filo di seta che non ha subito sgommatura, quindi ancora rivestito di sericina. Aspetto opaco e rigido, non accoglie bene la tintura.
definition: Loc. fém. Empr. de l’it. seta greggia, "soie brute". Fil obtenu en réunissant plusieurs baves (5 à 10) non tordues simplement soudés par le grès. C'est le produit du travail de filature qui se présente sous forme de "flottes". Il sera ensuite mouliné. Le fil de grège qui n'a subi ni lavage, ni blanchiment, ni teinture est dit "écru". @fr
definition: Any thread or yarn that has not gone through any dyeing process. @en

Filo secondo il materiale di cui è composto
type: Concept
preferred label: Yarn by origin @en
preferred label: Hilo según materia @es

Silk Heritage Thesaurus
type: ConceptScheme