Hilo briscado
type: Concept
broader: Hilo metálico
preferred label: Briscado thread @en
preferred label: Fil "briscado" @fr
preferred label: filo briscado @it
top concept of: Silk Heritage Thesaurus
in scheme: Silk Heritage Thesaurus
alternative label: hilo brescado
alternative label: hilo brizcado
bibliographic citation: J.-L. Barthélemi, Dictionnaire portatif et de pronunciation espagnol-français et français-espagnol a l'usage des deux nations..., Lyon, Chez B. Cormon et Blanc, 1803. @fr
bibliographic citation: Benito, Pilar. Paraísos de seda. Tejidos y bordados de las casas del Príncipe en los Reales Sitios de El Pardo y El Escorial. València: Universitat de València, 2015
bibliographic citation: Roberts A., Edward. A Comprehensive Etymological Dictionary of the Spanish Language with Families of Words Based on Indo-European Roots. Bloomington: Xlibris, 2014. @en
bibliographic citation: «Real Academia Española». Accedido 20 de noviembre de 2018. http://www.rae.es/
bibliographic citation: Boy, Jaime. Diccionario teórico, práctico, histórico y geográfico de comercio Vol. I-II-III-IV de la Junta de Comercio de Barcelona. Barcelona: Imprenta Valentín Torrás, 1840
definition: Hilo de metal, rizado, escarchado o retorcido utilizado en tejeduría.
definition: n. A term in Spanish that refers to twisted gold or silver thread. @en
definition: Loc. masc. Terme esp. sans équivalent en français qui qualifie les fils de soie mêlés à de l'or ou de l'argent. @fr
definition: Termine spagnolo senza corrispottivo in italiano che indica un filo metallico, riccio, ritorto usato nella tessitura. @it

Hilo metálico
type: Concept
preferred label: Oro / Argento tirato @it
preferred label: Fil métallique @fr
preferred label: Metal thread @en

Silk Heritage Thesaurus
type: ConceptScheme