Fiorentina
type: Concept
broader: Tessuto classificato in base alla sua provenienza geografica
preferred label: Florence (tissu) @fr
preferred label: Florentina @es
preferred label: Florentine @en
top concept of: Silk Heritage Thesaurus
in scheme: Silk Heritage Thesaurus
alternative label: marcelina @es
alternative label: taffeta de Florence @en
alternative label: fiorenza
related: Taffetà doppio
bibliographic citation: Mariella Azzali, Dizionario di costume e moda, dal filo all'abito, Roma, 2015
bibliographic citation: Dávila Corona, Rosa, Duran i Pujol, Montserrat, y García Fernández, Máximo. Diccionario histórico de telas y tejidos castellano-catalán. Salamanca: Junta de Castilla y León, 2004 @es
bibliographic citation: Bezon, Jean. Dictionnaire général des tissus anciens et modernes.‎ Tome 1.‎ Lyon: Th . Lepagnez, 1859, p. 83 @fr
bibliographic citation: Castany Saládrigas, Francisco. Diccionario de tejidos. Etimología, origen, arte, historia y fabricación de los más importantes tejidos clásicos y modernos. Gustavo Gil S.A., 1949. @es
bibliographic citation: E. Bianchi, Dizionario internazionale dei tessuti, Como, 1997
bibliographic citation: Aniello Gentile, Dizionario etimologico dell'arte tessile, Napoli, 1981
bibliographic citation: F. Pizzato, Tessuti & C. Piccolo dizionario dei termini del mestiere, Milano, 1992
bibliographic citation: Boy, Jaime. Diccionario teórico, práctico, histórico y geográfico de comercio Vol. I-II-III-IV de la Junta de Comercio de Barcelona. Barcelona: Imprenta Valentín Torrás, 1840 @es
bibliographic citation: Simpson, John; Weiner, Edmund (eds). The Oxford English Dictionary. Oxford : Clarendon Press ; Oxford ; New York : Oxford University Press, 1989; [www.oed.com]; Tortora, Phyllis, y Ingrid Johnson. The Fairchild Books Dictionary of Textiles, 2015 @en
definition: n. From the Latin "Flōrentīnus" of or pertaining to "Flōrentia" Florence. It is a textile fabric, mainly of silk, used for wearing apparel. Originally produced in Florence (Italy), from the 18th century also produced in Lyon, France. It is a lightweight taffeta, usually white, with a single warp and single filling or weft. @en
definition: Del lat. Florentīnus. Tejido de seda muy fino, de bcalidad madia, originario y característico de la ciudad italiana de Florencia, normalmente tejido en tafetán con una sola urdimbre, de color blanco labrado y muy imitado por los talleres de tejeduría de Francia. Se empleaba para hacer prendas de vestir exteriores, muy consumidos en el siglo XVIII. @es
definition: Subst. masc. Ce tissu est un taffetas en compte léger, dans la réduction d'environ 30 à 40 fils au centimètre (chaine simple) ; la réduction en trame est à peu près la même. Il se trame à un ou deux bouts. Le Florence est la plus légère étoffe qui se fabrique en taffetas. On l'emploie ordinairement pour les doublures. Ce taffetas, qui se fabriquait à Lyon, était très mince et d'une médiocre qualité. On en faisait de toutes les couleurs. @fr
definition: s.f. der. ' Firenze', dove in origine si fabbricava.Tessuto di seta su armatura saia, molto leggero, ma prodotto anche di peso medio, utilizzato per biancheria intima, camicie e camicette. Saia leggera e lucida, impiegata per abiti femminili.

Tessuto classificato in base alla sua provenienza geografica
type: Concept
preferred label: Geographic featured textiles @en
preferred label: Appellation usuelle ou commerciale @fr
preferred label: Tejidos determinados por su origen geográfico @es

Taffetà doppio
type: Concept
preferred label: Marceline @en
preferred label: Marceline (tissu) @fr
preferred label: Tafetán doble @es

Silk Heritage Thesaurus
type: ConceptScheme