Vestito da festa
type: Concept
broader: http://data.silknow.org/vocabulary/7000
preferred label: Vêtements de cérémonie @fr
preferred label: Indumentaria festiva @es
preferred label: Festive attire @en
top concept of: Silk Heritage Thesaurus
in scheme: Silk Heritage Thesaurus
bibliographic citation: G. Sergio, Parole di moda. Il "Corriere delle dame" e il lessico della moda nell'Ottocento, Milano, 2010.
bibliographic citation: Maggy Baum et Chantal Boyeldieu, Dictionnaire encyclopédique des textiles, Paris : Eyrolles, 2018. @fr
bibliographic citation: Treccani online. Accessed 25 July 2020. http://www.treccani.it//vocabolario/versione.
bibliographic citation: A. Donnanno, Modabolario. Parole e immagini della moda. Dizionario tecnico-creativo. Storia del costume tessuti e tessitura tecniche sartoriali accessori e stilisti, Milano, 2018
bibliographic citation: «Real Academia Española». Accedido 20 de noviembre de 2018. http://www.rae.es/. @es
definition: Loc. masc. pl. Vêtements portés lors d'événements particuliers ou associés à une cérémonie officielle ou religieuse (mariage, communion, etc.). Ils peuvent aussi se caractériser par la qualité et la beauté des étoffes utilisées. @fr
definition: Vestimenta que utiliza en momentos de celebración, fiestas y eventos sociales @es
definition: s.m. indumento da indossare per feste, cerimonie, eventi sociali importanti. Realizzato in tessuto prezioso e spesso adornato da applicazioni di pregio.
definition: It refers to the sets of clothing used in celebrations, festive and social events. @en

Silk Heritage Thesaurus
type: ConceptScheme