Trama (Componente tessile)
type: Concept
preferred label: Trame @fr
preferred label: Weft @en
preferred label: Trama @es

Trama metallica
type: Concept
broader: Trama (Componente tessile)
preferred label: Trama metálica @es
preferred label: Metallic weft @en
preferred label: Trame métallique @fr
top concept of: Silk Heritage Thesaurus
in scheme: Silk Heritage Thesaurus
alternative label: tramas metálicas @es
bibliographic citation: E. Bianchi, Dizionario internazionale dei tessuti, Como, 1997.
bibliographic citation: Aniello Gentile, Dizionario etimologico dell'arte tessile, Napoli, 1981
definition: Son aquellas tramas hechas con hilo de oro o plata, con o sin alma, en todas sus variantes @es
definition: Loc. fém. Trame appartenant à toutes les variantes de trames formées de fils d'or ou d'argent, avec ou sans âme. @fr
definition: Those wefts produced with gold or silver yarns with or without core. @en
definition: s.f. lat. trama, la trama, ovvero il filo trasversale del tessuto che può essere in oro o argento, con o senza anima, in tutte le sue varianti.

Silk Heritage Thesaurus
type: ConceptScheme