Vesti religiose
type: Concept
preferred label: Religious attire @en
preferred label: Costume écclésiastique @fr
preferred label: Indumentaria religiosa @es

Manteau (iconographie)
type: Concept
broader: Vesti religiose
preferred label: Manto (religioso)
preferred label: Mantle (religious) @en
top concept of: Silk Heritage Thesaurus
in scheme: Silk Heritage Thesaurus
alternative label: mantella
bibliographic citation: Michel Feuillet, Lexique des symboles chrétiens, Paris, PUF, 2017 @fr
bibliographic citation: E. Bianchi, Dizionario internazionale dei tessuti, Como, 1997
bibliographic citation: G. Sergio, Parole di moda. Il "Corriere delle dame" e il lessico della moda nell'Ottocento, Milano, 2010.
bibliographic citation: Maria Teresa Lucidi ( a cura di), Glossario dei termini tecnici occidentali, cinesi e giapponesi, in La seta e la sua via, Roma, 1994
bibliographic citation: Paul Perdrizet, La Vierge de miséricorde: étude d'un thème iconographique, Paris, Fontemoing, 1908. @fr
bibliographic citation: Gran Diccionario de la Lengua Española, 2016 Larousse Editorial @es
bibliographic citation: «Real Academia Española». Accedido 20 de noviembre de 2018. http://www.rae.es @es
bibliographic citation: Simpson, John; Weiner, Edmund (eds). The Oxford English Dictionary. Oxford : Clarendon Press ; Oxford ; New York : Oxford University Press, 1989. [www.oed.com] @en
bibliographic citation: A. Donnanno, Modabolario. Parole e immagini della moda. Dizionario tecnico-creativo. Storia del costume tessuti e tessitura tecniche sartoriali accessori e stilisti, Milano, 2018
bibliographic citation: Treccani online. Accessed 29 February 2020. http://www.treccani.it//vocabolario/versione
bibliographic citation: F. Pizzato, Tessuti & C. Piccolo dizionario dei termini del mestiere, Milano, 1992
definition: Del lat. mantum. Capa que se pone sobre las imágenes de la Virgen. @es
definition: Subst. masc. Issu du lat. mantellum, diminutif de mantum, "manteau". L'Occident a vu se développer au XIVe et XVe. s. l'image de la Vierge de Miséricorde enveloppée d'un manteau dont elle ouvre les pans, et sous lequel se blottit l'humanité venue chercher sa protection. On parle aussi de "Vierge du manteau". Cette iconographie a connu un grand succès en Italie, dans le contexte des épidémies de peste. @fr
definition: s. m. [lat. mantellum «velo», in epoca mediev. «mantello»] denominazione riferita al mantello indossato dalla Vergine Maria nelle raffigurazioni sacre. Indumento lungo e ampio, privo di maniche posto sopra la veste, appoggiato sulle spalle e agganciato al collo in modo che ricaschi tutto intorno alla persona e possa drappeggiarsi variamente. Rappresenta la regalità della figura mariana e di norma è di colore celeste.
definition: n. From Old and Middle English "mentel" "mantal" "mantille" "mantyl". It is, in general, a loose sleeveless and protective garment or blanket with religious or liturgical uses. @en

Silk Heritage Thesaurus
type: ConceptScheme