Tovaglia
type: Concept
broader: Paramento civile
preferred label: Nappe @fr
preferred label: Mantel @es
preferred label: Tablecloth @en
top concept of: Silk Heritage Thesaurus
in scheme: Silk Heritage Thesaurus
bibliographic citation: Treccani online. Accessed 20 February 2020. http://www.treccani.it//vocabolario/versione
bibliographic citation: Dictionnaire de l'Académie française, https://www.dictionnaire-academie.fr/article/A9N0058 @fr
bibliographic citation: «Real Academia Española». Accedido 20 de noviembre de 2018. http://www.rae.es/ @es
bibliographic citation: Simpson, John; Weiner, Edmund (eds). The Oxford English Dictionary. Oxford : Clarendon Press ; Oxford ; New York : Oxford University Press, 1989. [www.oed.com]; Stevenson, Angus ed. New Oxford American Dictionary. 3rd ed. Oxford University Press, 2010. @en
bibliographic citation: G. Sergio, Parole di moda. Il "Corriere delle dame" e il lessico della moda nell'Ottocento, Milano, 2010.
bibliographic citation: «Art & Architecture Thesaurus (Getty Research Institute)». Accedido 20 de noviembre de 2018. http://www.getty.edu/research/tools/vocabularies/aat/. @es
bibliographic citation: Maria Teresa Lucidi ( a cura di), Glossario dei termini tecnici occidentali, cinesi e giapponesi, in La seta e la sua via, Roma, 1994
bibliographic citation: CNRTL, https://cnrtl.fr/definition/nappe @fr
bibliographic citation: E. Bianchi, Dizionario internazionale dei tessuti, Como, 1997
bibliographic citation: A. Donnanno, Modabolario. Parole e immagini della moda. Dizionario tecnico-creativo. Storia del costume tessuti e tessitura tecniche sartoriali accessori e stilisti, Milano, 2018
bibliographic citation: F. Pizzato, Tessuti & C. Piccolo dizionario dei termini del mestiere, Milano, 1992
definition: Subst. fém. Issu du lat. mappa, "serviette". Linge que l'on dispose sur une table pour le repas ou pour la décoration. @fr
definition: Del lat. mantēle. Cubierta de lino, algodón u otra materia, que se pone en la mesa para comer u ornamentar. @es
definition: s. f. [dal provenz. toalha, che a sua volta è dal franco *thwahlja]. Tessuto di forma quadrata, rettangolare, ovale, circolare, bianca o anche colorata, variamente operato, ricamato o decorato, che si tende sulla tavola per apparecchiare la mensa. In ambito ecclesistico la tovaglia d’altare è un telo bianco che si stende sull’altare, sopra ad altri due teli dello stesso colore, per celebrarvi la messa.
definition: n. A piece of cloth, from diverse types of textiles, used to cover and protect a table, spread over it, during meals, or with no other function than to decorate. @en

Paramento civile
type: Concept
preferred label: Parements civils @fr
preferred label: Paramentos civiles @es
preferred label: Civil paraments @en

Silk Heritage Thesaurus
type: ConceptScheme