Intreccio composto
type: Concept
preferred label: Ligamento compuesto @es
preferred label: Armure composée @fr
preferred label: Composite weaving @en

Baiadera
type: Concept
broader: Tecnica di tessitura
preferred label: Bayadère (tissu) @fr
preferred label: Bayadère @en
preferred label: Bayadera @es
top concept of: Silk Heritage Thesaurus
in scheme: Silk Heritage Thesaurus
related: Intreccio composto
bibliographic citation: Castany Saládrigas, Francisco. Diccionario de tejidos. Etimología, origen, arte, historia y fabricación de los más importantes tejidos clásicos y modernos. Gustavo Gil S.A., 1949 @es
bibliographic citation: G. Sergio, Parole di moda. Il "Corriere delle dame" e il lessico della moda nell'Ottocento, Milano, 2010.
bibliographic citation: F. Pizzato, Tessuti & C. Piccolo dizionario dei termini del mestiere, Milano, 1992
bibliographic citation: Aniello Gentile, Dizionario etimologico dell'arte tessile, Napoli, 1981
bibliographic citation: CIETA. vocabulario Técnico Tejidos Español, francés, inglés, italiano. Lyon: Centre International d’Etude des Textiles Anciens, 1963 @es
bibliographic citation: E. Bianchi, Dizionario internazionale dei tessuti, Como, 1997
bibliographic citation: Tamara Boccherini, Paola Marabelli, Atlante di Storia del Tessuto, Itinerario nell'arte tessile dall'antichità al Déco,1995 Firenze
bibliographic citation: CIETA, Guelton, Marie-Hélène et Valansot, Odile (dir.). Vocabulaire technique français Lyon: Centre international d’étude des textiles anciens, 2020, p. 3 @fr
bibliographic citation: Villard, Claude. Manuel de théorie du tissage. Tome I. Lyon: A. Rey, 1948, p. 245 @fr
bibliographic citation: CIETA. Vocabulary of technical terms of fabrics (English, French, Italian, Spanish). Lyon: Centre International d’Etude des Textiles Anciens, 1964; Tortora, Phyllis, y Ingrid Johnson. The Fairchild Books Dictionary of Textiles, 2014. @en
bibliographic citation: Casa Aruta, Francisco. Diccionario de la industria textil. Barcelona: Labor, 1969 @es
bibliographic citation: Maria Teresa Lucidi ( a cura di), Glossario dei termini tecnici occidentali, cinesi e giapponesi, in La seta e la sua via, Roma, 1994
bibliographic citation: A. Donnanno, Modabolario. Parole e immagini della moda. Dizionario tecnico-creativo. Storia del costume tessuti e tessitura tecniche sartoriali accessori e stilisti, Milano, 2018
definition: Del fr. bayadère y del port. bailadeira 'bailarina'. Tejidos que presentan efectos de listas en el sentido de la trama, que se repiten de manera periódica, ya sean estas producidas por diferencias en el colorido, ligamento o materias. @es
definition: Subst. masc. De balliadère (XVIIIe s.), emprunté du portugais balhadeira, dérivé de balhar, "danser". On donne le nom de "Bayadères" à des étoffes composées de plusieurs armures s'alternant par le tissage pour former de bandes plus ou moins grandes, qui se succèdent dans le même sens que la trame. Ils sont obtenus avec une seule chaîne, qui travaille d'après les armures indiquées pendant un nombre de coups équivalent à la longueur de bandes exigées pour chacune d'elles. @fr
definition: n. From the French "Bayadère". A textile with straight or undulating stripes or bands formed by different binding systems. Those binding systems succeed each other in order, using the same way and entering. Usually of brilliant colours, maybe strongly contrasted. @en
definition: s.f. dal fr. bayadère, e questo dal port. bailadeira «ballerina», der. di bailar «ballare». Tessuto a fasce orizzontali prodotte dall'accostamento di armature diverse. Il nome fa riferimento all'abbigliamento delle antiche danzatrici indù.

Tecnica di tessitura
type: Concept
preferred label: Técnica de tejido @es
preferred label: Technique de tissage (technique) @fr
preferred label: Weaving techniques @en

Silk Heritage Thesaurus
type: ConceptScheme