Cremisino
type: Concept
preferred label: Cramoisi (attribut) @fr
preferred label: Carmesí (tejido) @es
preferred label: Crimson (fabric) @en

Ciclaton
type: Concept
preferred label: Ciclatón @es
preferred label: Ciclatoun @en
preferred label: Siglaton (tissu) @fr

Espumillón
type: Concept
preferred label: Crépon (tissu) @fr
preferred label: Crepon @en

Grisetta
type: Concept
preferred label: Grisette @en
preferred label: Griseta @es
preferred label: Grisette (tissu) @fr

Marezzato (tessuto)
type: Concept
preferred label: Moire (tissu) @fr
preferred label: Moiré (fabric) @en
preferred label: Muaré (tejido) @es

Tiraz
type: Concept

Tarlatana
type: Concept
preferred label: Tiretaine (tissu) @fr
preferred label: Linsey @en
preferred label: Tiritaña @es

Balastri
type: Concept
preferred label: Balastri (tissu) @fr

Tessuto (materiale)
type: Concept
broader: http://vocab.getty.edu/aat/300231580
narrower: Tiraz
narrower: Tarlatana
narrower: Espumillón
narrower: Balastri
narrower: Ciclaton
narrower: Grisetta
narrower: Cremisino
narrower: Marezzato (tessuto)
preferred label: Tejido @es
preferred label: Tissu @fr
preferred label: Fabric @en
top concept of: Silk Heritage Thesaurus
in scheme: Silk Heritage Thesaurus
bibliographic citation: CNRTL, https://www.cnrtl.fr/definition/tissu @fr
bibliographic citation: CIETA. Vocabulary of technical terms of fabrics (English, French, Italian, Spanish). Lyon: Centre International d’Etude des Textiles Anciens, 1964. @en
bibliographic citation: Dictionnaire de l'Académie française, https://www.dictionnaire-academie.fr/article/A8T0684 @fr
bibliographic citation: «Art & Architecture Thesaurus (Getty Research Institute)». Accedido 20 de noviembre de 2018. http://www.getty.edu/research/tools/vocabularies/aat/ @es
bibliographic citation: G. Sergio, Parole di moda. Il "Corriere delle dame" e il lessico della moda nell'Ottocento, Milano, 2010.
bibliographic citation: E. Bianchi, Dizionario internazionale dei tessuti, Como, 1997
bibliographic citation: Maria Teresa Lucidi ( a cura di), Glossario dei termini tecnici occidentali, cinesi e giapponesi, in La seta e la sua via, Roma, 1994
bibliographic citation: «Real Academia Española». Accedido 20 de noviembre de 2018. http://www.rae.es/. Castany Saládrigas, Francisco. Diccionario de tejidos. Etimología, origen, arte, historia y fabricación de los más importantes tejidos clásicos y modernos. Gustavo Gil S.A., 1949 @es
bibliographic citation: A. Donnanno, Modabolario. Parole e immagini della moda. Dizionario tecnico-creativo. Storia del costume tessuti e tessitura tecniche sartoriali accessori e stilisti, Milano, 2018
bibliographic citation: F. Pizzato, Tessuti & C. Piccolo dizionario dei termini del mestiere, Milano, 1992
definition: s.m. Materiale ottenuto dall'azione di tessitura, intrecciando vari elementi di materiale, di solito fibre filamentose, che si trasformano in un pezzo piatto.
definition: General term for any manufactured clothlike material such as clothings, hangings or coverings. It is the result of interweaving two warp and weft threads. @en
definition: Subst. masc. Participe passé de l’ancien français tistre (« tisser »), du latin texere "tisser" et "construire". Qui est produit, réalisé au moyen tissage, par l'entrecroisement régulier de fils ou de fibres. Tout en étant des produits d'une technologie (voir tissage), les tissus constituent des symboles culturels autant que des articles de commerce. Ils peuvent également être des œuvres d'art. Les arts textiles représentent une activité humaine fondamentale, tout en étant l'expression symbolique d'une grande partie de ce qui est en valeur dans n'importe quelle société. À la fin du XVIème siècle, le mot "étoffe "prend le sens plus spécifique de tissu servant à l'habillement ou à l'ameublement. @fr
definition: Del part. de tejer. El tejido es el resultado de entrelazar dos hilos de trama y urdimbre, por tanto se hace tejiendo, que dan como resultado una pieza plana. El origen terminológico de los tejidos es muy variado, algunos toman el nombre del ligamento, del mecanismo de fabricación , de su aspecto, origen... @es

Silk Heritage Thesaurus
type: ConceptScheme