Tappezzeria
type: Concept
preferred label: Tapicería @es
preferred label: Upholstery @en
preferred label: Tapisserie (activité) @fr

Tappezzeria fine
type: Concept
broader: Tappezzeria
preferred label: Fine upholstery @en
preferred label: Tapicería fina @es
preferred label: Tapisserie fine @fr
top concept of: Silk Heritage Thesaurus
in scheme: Silk Heritage Thesaurus
related: Lana
bibliographic citation: E. Bianchi, Dizionario internazionale dei tessuti, Como, 1997
bibliographic citation: A. Donnanno, Modabolario. Parole e immagini della moda. Dizionario tecnico-creativo. Storia del costume tessuti e tessitura tecniche sartoriali accessori e stilisti, Milano, 2018
bibliographic citation: F. Pizzato, Tessuti & C. Piccolo dizionario dei termini del mestiere, Milano, 1992
bibliographic citation: Herrero Carretero, Concha. Vocabulario histórico de la tapicería. Madrid: Patrimonio Nacional, 2008 @es
bibliographic citation: Cours de Licence professionnelle d'Histoire de l'art du textile et du tapis. Université Blaise Pascal, Clermont-Ferrand II, févr. 2005 @fr
bibliographic citation: Maria Teresa Lucidi ( a cura di), Glossario dei termini tecnici occidentali, cinesi e giapponesi, in La seta e la sua via, Roma, 1994
bibliographic citation: G. Sergio, Parole di moda. Il "Corriere delle dame" e il lessico della moda nell'Ottocento, Milano, 2010.
bibliographic citation: de Geest, Joost et al.. Charles Quint, Tapisseries et armures des collections royales d'Espagne. Bruxelles: Musées Royaux d'Art et d'Histoire et Patrimoine National d'Espagne, 1994 @fr
definition: Loc. masc. Issu du subst. lat. finis, au sens de "degré suprême, comble d’une chose". Terme usuel ou commercial, qui désigne une tapisserie de grande qualité, du meilleur choix, qui est appréciée et recherchée. En effet, simple décor mural produit en série tels que les Millefleurs, la tapisserie peut être une œuvre plus subtile élaborée par un peintre. Elle a connu de grands amateurs tels que le pape Léon X qui enrichit la collection vaticane en commandant à Raphaël l'exécution les cartons de la Tenture des Actes des Apôtres. Elle a fait aussi l'objet de collections prestigieuses comme celle de Charles Quint, qui fut l'une des plus importantes de son temps et celle de François Ier qui dans l'inventaire du garde-meuble en 1542, comptait plus de 200 pièces des manufactures bruxelloises. @fr
definition: Calidad superior de tapicería, tejida con seda y lana, y con un bajo número de hilos metálicos. @es
definition: s.f. Tappezzeria realizzata intrecciando oltre la seta e lana anche un moderato quantitativo di fili metallici
definition: It refers to a higher quality upholstery, woven in silk and wool, and with a lower number of metallic threads. @en

Lana
type: Concept
preferred label: Wool @en
preferred label: Laine @fr

Silk Heritage Thesaurus
type: ConceptScheme