Mécanique Jacquard
type: Concept
preferred label: Telaio Jacquard @it
preferred label: Telar Jacquard @es
preferred label: Jacquard loom @en

Carton perforé
type: Concept
broader: http://vocab.getty.edu/aat/300247544
preferred label: Scheda perforata @it
preferred label: Cartón @es
preferred label: Jacquard paper @en
top concept of: Silk Heritage Thesaurus
in scheme: Silk Heritage Thesaurus
alternative label: rastre @es
alternative label: encartonada @es
alternative label: Carton Jacquard
alternative label: tarjeta perforada @es
alternative label: board @en
related: Mécanique Jacquard
related: Q183414
bibliographic citation: CIETA, Guelton, Marie-Hélène et Valansot, Odile (dir.). Vocabulaire technique français Lyon: Centre international d’étude des textiles anciens, 2020, p. 29
bibliographic citation: Lami Eugène-Oscar. Dictionnaire encyclopédique et biographique de l'industrie et des arts industriels. Tome 6. Paris: Librairie Des Dictionnaires,1886, p. 484
bibliographic citation: Four, Pierre-Alain. Lyon et la soie : le dessin textile entre art et industrie (fiche n°6), 2007, https://www.millenaire3.com/ressources/lyon-et-la-soie-le-dessin-textile-entre-art-et-industrie
bibliographic citation: Villard, Claude. Manuel de théorie du tissage. Tome II. Lyon: A. Rey, 1948, p. 23-28
bibliographic citation: Casa Aruta, Francisco. Diccionario de la industria textil. Barcelona: Labor, 1969 @es
bibliographic citation: Casa Aruta, Francisco. Diccionario de la industria textil. Barcelona: Labor, 1969; «enciclopèdia.cat | El cercador de referència en català». Accedido 18 de enero de 2019. https://www.enciclopedia.cat/. @en
bibliographic citation: «enciclopèdia.cat | El cercador de referència en català». Accedido 18 de enero de 2019. https://www.enciclopedia.cat/. @es
bibliographic citation: Algoud, Henri, Grammaire des arts de la soie, Paris: Jean Schemit, 1912, p, 90
bibliographic citation: Pariset, Ernest. Les industries de la soie, sériciculture, filature, moulinage, tissage, teinture. Histoire et statistique, Lyon: Pitrat aîné, 1862, p. 277-287
bibliographic citation: Peyot, F., Cours complet de fabrique pour les étoffes de soie, Lyon: Perrin,1866, p. 68-70
bibliographic citation: Aulagnier, Fernande. Le dessin sur les étoffes de soie. In: L'information géographique, 10, 2, (1946), p. 81-82 doi : https://doi.org/10.3406/ingeo.1946.5162
definition: In the Jacquard machine, each tablet of cardboard, in which perforations are alternated with unperforated spaces. It adapts to the prism keys or cylinders carrying drawings, thus deciding on each pass, which needles will move and which will not, to control the movement of the threads in each draft. Each cardboard represents a different pick. @en
definition: Subst. masc. Empr. de l’it. cartone, augmentatif de carta, "papier", lui-même du lat. charta. Pour fabriquer un tissu à motif, le métier Jacquard ordonne la levée des fils de chaîne d’après les indications données par les cartons qui traduisent la mise en carte du dessin. Le lisage permet de confectionner un ensemble de feuilles de cartons, appelé jeu de cartons, présentant des trous et des pleins dans le but de reproduire en tissage le dessin de cette mise en carte. Les cartons sont perforés un à un. Chaque carton représente le programme d’une levée de fils de chaîne sur un passage de navette.
definition: s.f. Scheda di cartone o di metallo che presenta dei fori realizzati da una macchina perforatrice, viene utilizzata nei telai Jacquard o altri telai speciali. Ogni scheda perforata comanda i fili d'ordito ad ogni passaggio di trama: il foro fa alzare il filo, il pieno, lo lascia in riposo. Questo sistema permette di realizzare tesuti dai disegni più o meno complessi. @it
definition: De carta 'papel". En la máquina Jacquard, cada cartón del cartonaje, en el cual se alternan perforaciones con espacios sin perforar, se adapta a las llaves del prisma o cilindros porta dibujos, decidiendo así en cada pasada, qué agujas se desplazarán y cuáles no, para controlar el movimiento de los hilos en cada calada. Cada cartón representa una pasada distinta. @es
related match: Q183414

materials
type: Collection
member: paper

paper
type: Collection
member: Carton perforé

Silk Heritage Thesaurus
type: ConceptScheme