Blu di Sassonia
type: Concept
broader: http://vocab.getty.edu/aat/300311078
preferred label: Azul de Sajonia @es
preferred label: Bleu de Saxe @fr
preferred label: Sajonia blue @en
top concept of: Silk Heritage Thesaurus
in scheme: Silk Heritage Thesaurus
bibliographic citation: G. Sergio, Parole di moda. Il "Corriere delle dame" e il lessico della moda nell'Ottocento, Milano, 2010.
bibliographic citation: François Delamare, Bleus en poudres : de l'art à l'industrie, 5000 ans d'innovations, Paris : Mines Paris-les Presses ParisTech, 2008. @fr
bibliographic citation: A. Donnanno, Modabolario. Parole e immagini della moda. Dizionario tecnico-creativo. Storia del costume tessuti e tessitura tecniche sartoriali accessori e stilisti, Milano, 2018
bibliographic citation: Maria Teresa Lucidi ( a cura di), Glossario dei termini tecnici occidentali, cinesi e giapponesi, in La seta e la sua via, Roma, 1994
bibliographic citation: F. Pizzato, Tessuti & C. Piccolo dizionario dei termini del mestiere, Milano, 1992
bibliographic citation: E. Bianchi, Dizionario internazionale dei tessuti, Como, 1997
bibliographic citation: Casa Aruta, Francisco. Diccionario de la industria textil. Barcelona: Labor, 1969 @es
bibliographic citation: Sanz, Juan Carlos, Gallego, Rosa. Diccionario del color. Madrid: Akal S.A., 2001. @es
bibliographic citation: Casa Aruta, Francisco. Diccionario de la industria textil. Barcelona: Labor, 1969;Sanz, Juan Carlos, Gallego, Rosa. Diccionario del color. Madrid: Akal S.A., 2001 @en
definition: Preparado de índigo que se caracteriza por un excelente poder de igualación, buena solidez al lavado y poca a la luz. @es
definition: A denomination for prussian blue that denotes the procedence of this dye. @en
definition: agg. Blu i cui pigmenti derivano da minerali di partenza (cobaltite e smaltite) che venivano estratti da miniere in Boemia e Sassonia. Azzurro con una nota di verde e grigio.
definition: Loc. masc. Bleu produit en Saxe depuis la fin du XVe s. et qui provient de la découverte de mines de cobalt. Le bleu de Saxe correspond donc au bleu de cobalt. Ce n'est pas un bleu pur, comme le bleu de Prusse, et sa couleur est proche de l'outremer naturel. Dans le Colour Index, il porte l'identifiant Pigment Blue 28 CI 77 346. @fr

Silk Heritage Thesaurus
type: ConceptScheme