Filoselle (Fil)
type: Concept
preferred label: Filadiz @es
preferred label: Floss (thread) @en
preferred label: Strusa @it

Satin (armure)
type: Concept
preferred label: Raso (ligamento) @es
preferred label: Raso (armatura) @it
preferred label: Satin (weave) @en

Organsin (fil)
type: Concept
preferred label: Organzino (filo) @it
preferred label: Organzine @en
preferred label: Hilo de organzí @es

Soie grège
type: Concept
preferred label: Seda cruda @es
preferred label: Seta cruda @it
preferred label: Hard silk @en

Sergé (tissu)
type: Concept
preferred label: Asargado @es
preferred label: Serge @en

Satin irrégulier
type: Concept
preferred label: Irregular satin @en
preferred label: Raso irregolare @it
preferred label: Raso irregular @es

Radamés (tissu)
type: Concept
broader: Technique de tissage (technique)
preferred label: Radamés @es
preferred label: Radames @en
preferred label: Rhadamés
top concept of: Silk Heritage Thesaurus
in scheme: Silk Heritage Thesaurus
alternative label: Rhadame
alternative label: rhadames @en
related: Organsin (fil)
related: Soie grège
related: Filoselle (Fil)
related: Satin (armure)
related: Sergé (tissu)
related: Satin irrégulier
bibliographic citation: Castany Saládrigas, Francisco. Diccionario de tejidos. Etimología, origen, arte, historia y fabricación de los más importantes tejidos clásicos y modernos. Gustavo Gil S.A., 1949 @es
bibliographic citation: Tortora, Phyllis, y Ingrid Johnson. The Fairchild Books Dictionary of Textiles, 2015. @en
bibliographic citation: «Real Academia Española». Accedido 20 de noviembre de 2018. http://www.rae.es/ @es
bibliographic citation: Villard, Claude. Manuel de théorie du tissage. Tome I. Lyon: A. Rey, 1948, p. 211
bibliographic citation: Hardouin-Fugier, Élisabeth, Berthod, Bernard, Chavent-Fusaro, Martine et Déprez, Camille. Les étoffes : dictionnaire historique. Paris: l’Amateur (1994), 2005, p. 325
bibliographic citation: Dávila Corona, Rosa, Duran i Pujol, Montserrat, y García Fernández, Máximo. Diccionario histórico de telas y tejidos castellano-catalán. Salamanca: Junta de Castilla y León, 2004. @es
definition: Termine che nella specifica bibliografia francese indica un tessuto con armature fantasiose, che nasconde un'armatura classica, ma il cui intreccio non rispetta le regole canoniche. Il tessuto sembra regolare a causa della ripetizione di un motivo o di un rapporto. @it
definition: Del fr. rhadamès. Tejido de seda cruda con urdimbre organcí, o a veces, filadiz de títulos muy finos, y trama filadiz. Tiene como característica que presenta una de las caras satinadas (efecto de urdimbre) y la otra asargada (efecto de trama) resultado que se obtiene utilizando los ligamentos rasos irregulares de curso rectangular. @es
definition: Subst. masc. Sous ce nom, on désigne assez souvent une armure sergé qui donne des côtes moins accentuées que le sergé ordinaire et dont les sillons sont supprimés. Les côtes semblent séparées par un croisement et non par des liages. Le rapport comprend généralement un nombre de fils double de celui du sergé choisi, le nombre de coups restant celui du sergé.
definition: n. It refers to a strong, lustrous silk or silk and cotton fabric, made in a twill or satin weave interlaced to give an indefinite twill line. It is made in medium weights and piece dyed and usually used for dresses or linings. @en

Technique de tissage (technique)
type: Concept
preferred label: Técnica de tejido @es
preferred label: Tecnica di tessitura @it
preferred label: Weaving techniques @en

Silk Heritage Thesaurus
type: ConceptScheme