Trama (Componente tessile)
type: Concept
preferred label: Trame @fr
preferred label: Weft @en
preferred label: Trama @es

Trama supplementare
type: Concept
broader: Trama (Componente tessile)
preferred label: Trame supplémentaire @fr
preferred label: Supplementary weft @en
preferred label: Trama suplementaria @es
top concept of: Silk Heritage Thesaurus
in scheme: Silk Heritage Thesaurus
bibliographic citation: A. Donnanno, Modabolario. Parole e immagini della moda. Dizionario tecnico-creativo. Storia del costume tessuti e tessitura tecniche sartoriali accessori e stilisti, Milano, 2018
bibliographic citation: G. Sergio, Parole di moda. Il "Corriere delle dame" e il lessico della moda nell'Ottocento, Milano, 2010.
bibliographic citation: Maria Teresa Lucidi ( a cura di), Glossario dei termini tecnici occidentali, cinesi e giapponesi, in La seta e la sua via, Roma, 1994
bibliographic citation: CIETA. vocabulario Técnico Tejidos Español, francés, inglés, italiano. Lyon: Centre International d’Etude des Textiles Anciens, 1963 @es
bibliographic citation: Mariella Azzali, Dizionario di costume e moda, dal filo all'abito, Roma, 2015
bibliographic citation: Burnham, Dorothy. Warp and Weft. A Textile Terminology. Royal Ontario Museum, 1980. @es
bibliographic citation: Tortora, Phyllis, y Ingrid Johnson. The Fairchild Books Dictionary of Textiles, 2014 @es
bibliographic citation: E. Bianchi, Dizionario internazionale dei tessuti, Como, 1997
bibliographic citation: F. Pizzato, Tessuti & C. Piccolo dizionario dei termini del mestiere, Milano, 1992
bibliographic citation: Baum, Maggy et Boyeldieu, Chantal. Dictionnaire encyclopédique des textiles. Paris: Eyrolles, 2018 @fr
definition: It refers to a supplementary weft that is non-structural. That is, it is added to create a pattern or to enrich a weave. @en
definition: Trama que tiene como objeto formar la decoración encima de otra trama de base. @es
definition: Loc. fém. Trame additionnelle généralement utilisée pour créer le décor, le dessin, les motifs (trame brochée, trame lancée). @fr
definition: s.f. Una trama addizionale introdotta su un fondo già tessuto con un movimento limitato all'area richiesta. L' inserimento di trame supplementari localizzato solo in alcuni punti è detto lavorazione a broccato.

Silk Heritage Thesaurus
type: ConceptScheme