Velluto
type: Concept
preferred label: Terciopelo @es
preferred label: Velvet @en
preferred label: Velours (armure) @fr

Velluto per trama
type: Concept
broader: Velluto
narrower: Panné
preferred label: Velours par la trame (armure) @fr
preferred label: Terciopelo por trama @es
preferred label: Weft-pile weave @en
top concept of: Silk Heritage Thesaurus
in scheme: Silk Heritage Thesaurus
alternative label: Velours de trame @fr
alternative label: Velours coton @fr
bibliographic citation: F. Pizzato, Tessuti & C. Piccolo dizionario dei termini del mestiere, Milano, 1992
bibliographic citation: A. Donnanno, Modabolario. Parole e immagini della moda. Dizionario tecnico-creativo. Storia del costume tessuti e tessitura tecniche sartoriali accessori e stilisti, Milano, 2018
bibliographic citation: CIETA. Vocabulary of technical terms of fabrics (English, French, Italian, Spanish). Lyon: Centre International d’Etude des Textiles Anciens, 1964; Burnham, Dorothy. Warp and Weft. A Textile Terminology. Royal Ontario Museum, 1980. @en
bibliographic citation: Galcerán Escobet, Vicente. Tecnología del tejido, Tomo primero: teoría de tejidos. Tarrasa: Editograf Pina, 1960. @es
bibliographic citation: G. Sergio, Parole di moda. Il "Corriere delle dame" e il lessico della moda nell'Ottocento, Milano, 2010.
bibliographic citation: Maria Teresa Lucidi ( a cura di), Glossario dei termini tecnici occidentali, cinesi e giapponesi, in La seta e la sua via, Roma, 1994
bibliographic citation: CIETA Vocabolario tecnico dei tessuti Italiano - Francese - Inglese. Lyon: Centre International d’Etude des Textiles Anciens, 2019
bibliographic citation: Castany Saládrigas, Francisco. Diccionario de tejidos. Etimología, origen, arte, historia y fabricación de los más importantes tejidos clásicos y modernos. Gustavo Gil S.A., 1949 @es
bibliographic citation: Blanxart y Pedrals, Daniel. La Industria Textil. Barcelona: Imp. A. Ortega, 1946 @es
bibliographic citation: Villard, Claude. Manuel de théorie du tissage. Tome I. Lyon: A. Rey, 1948, p. 235-237 @fr
bibliographic citation: Hardouin-Fugier, Élisabeth, Berthod, Bernard, Chavent-Fusaro, Martine et Déprez, Camille. Les étoffes : dictionnaire historique. Paris: l’Amateur, 1994, p. 235-237 @fr
bibliographic citation: E. Bianchi, Dizionario internazionale dei tessuti, Como, 1997
bibliographic citation: CIETA. vocabulario Técnico Tejidos Español, francés, inglés, italiano. Lyon: Centre International d’Etude des Textiles Anciens, 1963 @es
bibliographic citation: CIETA, Guelton, Marie-Hélène et Valansot, Odile (dir.). Vocabulaire technique français Lyon: Centre international d’étude des textiles anciens, 2020, p. 54 @fr
definition: Terciopelo liso o con bordones que suele ser de algodón. Suelen tener una urdimbre y una trama de basamento, y otra trama destinada a producir bastas para ser cortadas. Así pues, después del tisaje se corta mecánica o manualmente las bastas de trama, con el objetivo de producir pelo. @es
definition: Loc. masc. Le velours de trame est une étoffe dont l'armure produit un corps principal, qui constitue la base du tissu et des flottés de trame combinés pour être coupés et relevés, de sorte que l'étoffe présente l'aspect et le caractère du velours coupé. Ce velours est exécuté avec une seule chaîne qui travaille suivant les cas avec une ou deux trames. Le tissage des velours par la trame offre moins de ressources et n'est guère employé que pour les velours de coton. Le "velours coton" peut être à armure lisse (à base de taffetas) ou à armure croisée (dont la base est un sergé) et se présente donc sous l'aspect d'un velours uni ou d'un velours côtelé. Le poil est produit après le tissage par la coupe qui rentre plutôt dans l'apprêt que dans le tissage proprement dit. @fr
definition: s.m. Velluto unito o a coste, di solito in cotone, ottenuto dopo la tessitura dal taglio manuale o meccanico delle slegature di trama di un’armatura ad effetto trama.
definition: A type of weave in which a pile is produced by floats of a supplementary weft added to the ground weave. Those floats are cut after the weaving to form the pile. Weft loop weave, velveteen, corduroy, etc are terms sometimes used for some of these constructions. @en

Panné
type: Concept
preferred label: Pana @es
preferred label: Panne (tissu) @fr
preferred label: Corduroy @en

techniques
type: Collection
member: velvet

velvet
type: Collection
member: Velluto per trama

Silk Heritage Thesaurus
type: ConceptScheme