Tela doppia
type: Concept
broader: Caratteristiche secondo modifiche del tessuto
preferred label: Double étoffe (tissu) @fr
preferred label: Doble tela @es
preferred label: Double weave @en
top concept of: Silk Heritage Thesaurus
in scheme: Silk Heritage Thesaurus
alternative label: Double pièce @fr
alternative label: double cloth @en
related: Matelassé
bibliographic citation: CIETA Vocabolario tecnico dei tessuti Italiano - Francese - Inglese. Lyon: Centre International d’Etude des Textiles Anciens, 2019
bibliographic citation: Académie française. « Dictionnaire de l’Académie française », https://www.dictionnaire-academie.fr/article/A9D3116 @fr
bibliographic citation: F. Pizzato, Tessuti & C. Piccolo dizionario dei termini del mestiere, Milano, 1992
bibliographic citation: Casa Aruta, Francisco. Diccionario de la industria textil. Barcelona: Labor, 1969 @es
bibliographic citation: E. Bianchi, Dizionario internazionale dei tessuti, Como, 1997
bibliographic citation: CIETA. vocabulario Técnico Tejidos Español, francés, inglés, italiano. Lyon: Centre International d’Etude des Textiles Anciens, 1963 @es
bibliographic citation: A. Donnanno, Modabolario. Parole e immagini della moda. Dizionario tecnico-creativo. Storia del costume tessuti e tessitura tecniche sartoriali accessori e stilisti, Milano, 2018
bibliographic citation: Maria Teresa Lucidi ( a cura di), Glossario dei termini tecnici occidentali, cinesi e giapponesi, in La seta e la sua via, Roma, 1994
bibliographic citation: G. Sergio, Parole di moda. Il "Corriere delle dame" e il lessico della moda nell'Ottocento, Milano, 2010.
bibliographic citation: Hollen, Norma, and Jane Saddler. Introducción a Los Textiles. México: Editorial Limusa, 2002. @es
bibliographic citation: CIETA, Guelton, Marie-Hélène et Valansot, Odile (dir.). Vocabulaire technique français Lyon: Centre international d’étude des textiles anciens, 2020, p. 14 @fr
bibliographic citation: Villard, Claude. Manuel de théorie du tissage. Tome I. Lyon: A. Rey, 1948, p. 204 @fr
bibliographic citation: CIETA. Vocabulary of technical terms of fabrics (English, French, Italian, Spanish). Lyon: Centre International d’Etude des Textiles Anciens, 1964; Tortora, Phyllis, y Ingrid Johnson. The Fairchild Books Dictionary of Textiles, 2015. @en
definition: Subst. fém. Les tissus double étoffe sont constitués par deux pièces tissées ensemble et l'une au-dessus de l'autre, d'après diverses combinaisons pour former des genres spéciaux : 1. Les tissus tubulaires. 2. Les tissus double étoffe combinés pour donner des tissus en double largeur d'exécution. 3. Les tissus double pièce pour former, après le tissage, deux pièces séparées (velours double pièce). Ces différents genres d'étoffe nécessitent une chaîne pour la formation de la pièce de dessous et une chaîne pour la formation de la pièce de dessus. Les deux chaînes peuvent être placées sur un seul rouleau de chaîne. Le tissage est exécuté pour les deux premiers cas avec une seule navette. Pour le troisième genre, on tisse avec une ou deux navettes. @fr
definition: Tejido compuesto, formado por dos telas sencillas superpuestas, es la combinación de tisaje que produce una ejecución simultánea de más de dos tejidos superpuestos. @es
definition: s.f. Un tessuto è doppio quando presenta due facce tessute in strati indipendenti disposti uno sull’altro. Può essere tessuto in modo che i due strati siano completamente staccati o tenuti insieme dalle cimose oppure uniti lungo un lato soltanto. Quando sono costituiti da aree che si scambiano sono detti tessuti doppio alternati. Invece si definiscono tessuti doppi legati se presentano punti di legatura fra l’uno e l’altro per tenerli insieme, oppure tessuti doppi con ordito di legatura se condividono un ordito di legatura. Per estensione si usa il termine anche per indicare più di due tessuti sovrapposti eseguiti simultaneamente. Es: tessuto triplo.
definition: A two-layered cloth made by weavingthe two layers, one above the other, in the same loom, simultaneously. The warp is composed by two sets of ends, and each is interlaced with its own weft, or with a common weft which works with each set in tum. The main uses are for overcoats, sportswear, bathrobes, blankets, upholstery fabrics, industrial fabrics, among others. @en

Caratteristiche secondo modifiche del tessuto
type: Concept
preferred label: Textile modifications attributes @en
preferred label: Les erreurs de tissage @fr
preferred label: Atributos según las modificaciones de los textiles @es

Matelassé
type: Concept
preferred label: Matelassé (tissu) @fr
preferred label: Acolchado @es

other technique
type: Collection
member: Tela doppia

techniques
type: Collection
member: other technique

Silk Heritage Thesaurus
type: ConceptScheme