Binatura
type: Concept
broader: Filo secondo la torsione
preferred label: Double @en
preferred label: Doublage @fr
preferred label: Doblaje @es
top concept of: Silk Heritage Thesaurus
in scheme: Silk Heritage Thesaurus
alternative label: doblado @es
bibliographic citation: Marín López, Rafael. Documentos para la historia de la seda en el Reino de Granada (siglos XV-XVIII). Granada: Universidad de Granada, 2008 @es
bibliographic citation: A. Donnanno, Modabolario. Parole e immagini della moda. Dizionario tecnico-creativo. Storia del costume tessuti e tessitura tecniche sartoriali accessori e stilisti, Milano, 2018
bibliographic citation: F. Pizzato, Tessuti & C. Piccolo dizionario dei termini del mestiere, Milano, 1992
bibliographic citation: CIETA, Guelton, Marie-Hélène et Valansot, Odile (dir.). Vocabulaire technique français Lyon: Centre international d’étude des textiles anciens, 2020, p. 13 @fr
bibliographic citation: E. Bianchi, Dizionario internazionale dei tessuti, Como, 1997
bibliographic citation: Mariella Azzali, Dizionario di costume e moda, dal filo all'abito, Roma, 2015
bibliographic citation: Casa Aruta, Francisco. Diccionario de la industria textil. Barcelona: Labor, 1969 @es
bibliographic citation: Maria Teresa Lucidi ( a cura di), Glossario dei termini tecnici occidentali, cinesi e giapponesi, in La seta e la sua via, Roma, 1994
bibliographic citation: G. Sergio, Parole di moda. Il "Corriere delle dame" e il lessico della moda nell'Ottocento, Milano, 2010.
bibliographic citation: CIETA. Vocabulary of technical terms of fabrics (English, French, Italian, Spanish). Lyon: Centre International d’Etude des Textiles Anciens, 1964. @en
bibliographic citation: Pariset, Ernest. Les industries de la soie, sériciculture, filature, moulinage, tissage, teinture. Histoire et statistique, Lyon: Pitrat aîné, 1862, p. 124 @fr
bibliographic citation: CIETA. vocabulario Técnico Tejidos Español, francés, inglés, italiano. Lyon: Centre International d’Etude des Textiles Anciens, 1963 @es
definition: v. The action of joining two or more ends which are twisted to made heavier threads. @en
definition: De doblar. Grupo de hilos que una vez torcidos forman un conjunto. @es
definition: Subst. masc. Dér. de doubler. Action qui consiste à réunir des fils ensemble, en vue de les assembler par torsion (moulinage). Le doublage est une opération très délicate. Les brins assemblés doivent être également tendus, ce que l'on obtient d'habitude en les faisant passer sur un fil de fer recouvert de drap appelé "queue de rat". @fr
definition: s.f. Nella lavorazione della seta consiste nell'accoppiamento di più fili per realizzare filati di diametro maggiore. Segue la lavorazione di torcitura per conferire la necessaria torsione ai filati e per evitare che i fili si separino.

Filo secondo la torsione
type: Concept
preferred label: Yarn by twist @en
preferred label: Fil mouliné @fr
preferred label: Hilo según torsión @es

Silk Heritage Thesaurus
type: ConceptScheme