Garza (aggettivo)
type: Concept
preferred label: Gauze (attribute) @en
preferred label: Gasa (atributo) @es
preferred label: Gaze (attribut) @fr

Garza (tessuto)
type: Concept
preferred label: Gauze (fabric) @en
preferred label: Gasa (tejido) @es
preferred label: Gaze (tissu) @fr

Marlí
type: Concept
broader: Garza (tessuto)
preferred label: Marli @en
preferred label: Marli (tissu) @fr
top concept of: Silk Heritage Thesaurus
in scheme: Silk Heritage Thesaurus
alternative label: marli lace @en
alternative label: Marly @fr
alternative label: Marlie @fr
related: Seta cruda
related: Garza (aggettivo)
related: Tulle
related: Lino
bibliographic citation: Bezon, Jean. Dictionnaire général des tissus anciens et modernes.‎ Tome 5. ‎ Paris: Savy, 1861, p. 216-217 @fr
bibliographic citation: Maria Teresa Lucidi ( a cura di), Glossario dei termini tecnici occidentali, cinesi e giapponesi, in La seta e la sua via, Roma, 1994
bibliographic citation: Castany Saládrigas, Francisco. Diccionario de tejidos. Etimología, origen, arte, historia y fabricación de los más importantes tejidos clásicos y modernos. Gustavo Gil S.A., 1949. @es
bibliographic citation: G. Sergio, Parole di moda. Il "Corriere delle dame" e il lessico della moda nell'Ottocento, Milano, 2010.
bibliographic citation: Encyclopédie ou Dictionnaire raisonné des sciences, des arts et des métiers, par une Société de Gens de lettres, https://artflsrv03.uchicago.edu/philologic4/encyclopedie1117/navigate/10/619/?byte=1384080 @fr
bibliographic citation: A. Donnanno, Modabolario. Parole e immagini della moda. Dizionario tecnico-creativo. Storia del costume tessuti e tessitura tecniche sartoriali accessori e stilisti, Milano, 2018
bibliographic citation: F. Pizzato, Tessuti & C. Piccolo dizionario dei termini del mestiere, Milano, 1992
bibliographic citation: Casa Aruta, Francisco. Diccionario de la industria textil. Barcelona: Labor, 1969 @es
bibliographic citation: Dávila Corona, Rosa., Duran i Pujol, Montserrat, y García Fernández, Máximo. Diccionario histórico de telas y tejidos castellano-catalán. Salamanca: Junta de Castilla y León, 2004 @es
bibliographic citation: E. Bianchi, Dizionario internazionale dei tessuti, Como, 1997
bibliographic citation: Tortora, Phyllis, y Ingrid Johnson. The Fairchild Books Dictionary of Textiles, 2015; Simpson, John; Weiner, Edmund (eds). The Oxford English Dictionary. Oxford : Clarendon Press; Oxford ; New York : Oxford University Press, 1989. [www.oed.com] @en
definition: Gasa muy ligera o tul de blonda, fabricada en algodón o en seda china, muy extendida en el siglo XVIII. El gran marlí se fabricaba en seda cruda negra y con la trama de hilo de Bretaña. @es
definition: s.m. Chiffon leggero o tulle di pizzo, realizzato con filo o seta cinese, molto diffuso nel XVIII secolo. Il grande marlí era fabbricato in seta nera grezza e con la trama del filo di Bretagna.
definition: n. A term borrowed from the French "marly". It refers to a lightweight kind of French bobbin lace consisting of a fine mesh ground similar to gauze or tulle, sometimes embroidered with small round dots or spots. @en
definition: Sust. Masc. Le tissu désigné sous le nom de "marli", qui appartenait à la famille des gazes, ne se faisait plus en 1861. La seule différence entre la gaze et le Marli simple consistait dans l'écartement plus important des fils d'où résultait un tissu à plus grand trous. On faisait des marlis en soie de Chine (Sina ou Nankin) en chaine et trame, cette dernière étant à trois bouts. On employait aussi quelquefois de la soie du Piémont jaune écru pour la chaîne et des soies grèges à un bout pour la trame. Le marli fin en soie de Chine ne recevait aucun apprêt. Pour les marlis en couleur, la soie était teinte en écru. Pour les gros marlis, dit "marlis de fil", on employait pour chaîne de la soie grège et jaune et pour trame du fil de Bretagne. Ils étaient apprêtés avec de l'amidon et de la gomme, après avoir été décreusés. Le "marli doublé" ou "croisé" s'appelait "Marli d'Angleterre". Il différait du "marli ordinaire" par sa composition avec deux chaînes, l'une de fond et l'autre poil et il ne recevait, pas d'apprêt. @fr

Seta cruda
type: Concept
preferred label: Seda cruda @es
preferred label: Hard silk @en
preferred label: Soie grège @fr

Tulle
type: Concept
preferred label: Tul @es
preferred label: Tulle (tissu) @fr

Lino
type: Concept
preferred label: Lin @fr
preferred label: Flax @en

Silk Heritage Thesaurus
type: ConceptScheme