Liccio di alzata
type: Concept
broader: Liccio
preferred label: Lifting shaft @en
preferred label: Lizo de alza @es
preferred label: Lisse de levée @fr
top concept of: Silk Heritage Thesaurus
in scheme: Silk Heritage Thesaurus
related: Maglia
related: Ordito
bibliographic citation: Falcot, Pierre. Traité encyclopédique et méthodique de la fabrication des tissus. Tome 1, Elbeuf: l’auteur, Mulhouse: Risler, 1852, p. 118 @fr
bibliographic citation: CIETA Vocabolario tecnico dei tessuti Italiano - Francese - Inglese. Lyon: Centre International d’Etude des Textiles Anciens, 2019
bibliographic citation: A. Donnanno, Modabolario. Parole e immagini della moda. Dizionario tecnico-creativo. Storia del costume tessuti e tessitura tecniche sartoriali accessori e stilisti, Milano, 2018
bibliographic citation: CIETA, Guelton, Marie-Hélène et Valansot, Odile (dir.). Vocabulaire technique français Lyon: Centre international d’étude des textiles anciens, 2020, p. 29 @fr
bibliographic citation: F. Pizzato, Tessuti & C. Piccolo dizionario dei termini del mestiere, Milano, 1992
bibliographic citation: Maria Teresa Lucidi ( a cura di), Glossario dei termini tecnici occidentali, cinesi e giapponesi, in La seta e la sua via, Roma, 1994
bibliographic citation: E. Bianchi, Dizionario internazionale dei tessuti, Como, 1997
bibliographic citation: Burnham, Dorothy. Warp and Weft. A Textile Terminology. Royal Ontario Museum, 1980. @en
bibliographic citation: G. Sergio, Parole di moda. Il "Corriere delle dame" e il lessico della moda nell'Ottocento, Milano, 2010.
bibliographic citation: CIETA. vocabulario Técnico Tejidos Español, francés, inglés, italiano. Lyon: Centre International d’Etude des Textiles Anciens, 1963 @es
definition: Loc. fém. L'emploi des métiers à marches permet la confection des armures toile, attendu que ce genre de croisement exige d'être confectionné à la lève et à la baisse, c'est-à-dire que la moitié des lisses, et par conséquent des fils de la chaîne, lève en même temps que l'autre moitié baisse, ce qui a lieu alternativement une fois par les fils pairs et une fois par les fils impairs. Pour obtenir ce mouvement simultané de lève et baisse, on se sert indistinctement de rouleaux, de poulies, ou bien encore de leviers connus sous le nom de "bricotteaux", et disposés en conséquence. La lisse de levée est la lisse dont les mailles agissent exclusivement pour soulever les fils de chaîne. @fr
definition: s.m. Liccio le cui maglie lavorano esclusivamente per sollevare i fili di ordito.
definition: It refers to that shaft which acts exclusively to raise the warp ends. @en
definition: Lizo cuyas mallas se accionan exclusivamente para levantar los hilos de urdimbre. @es

Liccio
type: Concept
preferred label: Shaft @en
preferred label: Lisse @fr
preferred label: Lizo @es

Maglia
type: Concept
preferred label: Malla @es
preferred label: Maille @fr
preferred label: Leash @en

Ordito
type: Concept
preferred label: Warp (yarn) @en
preferred label: Chaîne @fr
preferred label: Urdimbre @es

Silk Heritage Thesaurus
type: ConceptScheme