Fibra animale
type: Concept
broader: Fibra naturale
narrower: Séta
narrower: Bisso
narrower: Lana
preferred label: Fibra animal @es
preferred label: Animal fibre @en
preferred label: Fibre animale @fr
top concept of: Silk Heritage Thesaurus
in scheme: Silk Heritage Thesaurus
related: Filatura (processo)
bibliographic citation: « Centre National de Ressources Textuelles et Lexicales », https://www.cnrtl.fr/definition/academie9/fibre @fr
bibliographic citation: A. Donnanno, Modabolario. Parole e immagini della moda. Dizionario tecnico-creativo. Storia del costume tessuti e tessitura tecniche sartoriali accessori e stilisti, Milano, 2018
bibliographic citation: Benito, Pilar. Paraísos de seda. Tejidos y bordados de las casas del Príncipe en los Reales Sitios de El Pardo y El Escorial. València: Universitat de València, 2015. @es
bibliographic citation: Aniello Gentile, Dizionario etimologico dell'arte tessile, Napoli, 1981
bibliographic citation: F. Pizzato, Tessuti & C. Piccolo dizionario dei termini del mestiere, Milano, 1992
bibliographic citation: G. Sergio, Parole di moda. Il "Corriere delle dame" e il lessico della moda nell'Ottocento, Milano, 2010.
bibliographic citation: E. Bianchi, Dizionario internazionale dei tessuti, Como, 1997
bibliographic citation: Cervera i Caminal, Anna, Mumbrú i Laporta,Josep, Pont i Puntigam, M. Rosa, Taló i Rovira, Joan. Diccionari de la indústria tèxtil. Català, Castellà, Francés, Anglés i Alemany. Barcelona: Universitat Politècnica de Catalunya: Servei de llengües i terminologia de la UPC, s. f. @es
bibliographic citation: Maria Teresa Lucidi ( a cura di), Glossario dei termini tecnici occidentali, cinesi e giapponesi, in La seta e la sua via, Roma, 1994
bibliographic citation: Tortora, Phyllis, y Ingrid Johnson. The Fairchild Books Dictionary of Textiles, 2015; Segal, William. Encyclopedia of Textiles. New Jersey: Prentice Hall, 1972 @en
definition: Any fibre obtained from an animal in order to be used for weaving, knitting or felting into fabric. Generally it is taken from hair, fur or cocoons, as it is for silk. @en
definition: Loc. fém. Empr. du lat. animalis, ‑e, dér. de anima "principe vital, souffle de vie". Filament souple, d'origine animale, qui peut être utilisé pour la production de fils. À la base de toute fibre animale, il y a des protéines comme la kératine (composant des fibres issues de la laine (mouton) ou du pelage (Alpaga, Cachemire, lapin…) ou la fibroïne (soie). @fr
definition: s.f. Le fibre tessili animali hanno origine e sono elaborate da ghiandole poste sotto l'epidermide di alcuni animali e sono chiamate peli o crine oppure sono prodotte dalla secrezione di insetti (seta) e sono dette a filamento continuo.
definition: La que se obtiene de diversos tipos de animales y por lo tanto de alto contenido en proteínas. Son muchos y muy dispares los animales de los que se ha servido el ser humano para la obtención de fibras y con ellas la elaboración de hilos para la creación de textiles. La hilatura del pelo o las crines de muy diferentes especies como ovejas, cabras, caballos, camélidos, conejos, etc., da como resultado hilos con los que producir tejidos resistentes, cálidos y con un carácter altamenete aislante. Sin embargo la fibra textil de origen animal de mayor importancia a lo largo de toda la historia de la humanidad, es la seda que siempre se ha considerado como la fibra de mejor calidad y más lujosa. @es

Fibra naturale
type: Concept
preferred label: Natural fibre @en
preferred label: Fibre naturelle @fr
preferred label: Fibra natural @es

Séta
type: Concept
preferred label: Seda @es
preferred label: Soie de chenille @fr
preferred label: Silk @en

Bisso
type: Concept
preferred label: Byssus @fr
preferred label: Biso @es

Lana
type: Concept
preferred label: Laine @fr
preferred label: Wool @en

Filatura (processo)
type: Concept
preferred label: Filature (technique) @fr
preferred label: Hilatura (técnica) @es

animal fibre
type: Collection
member: Fibra animale

materials
type: Collection
member: animal fibre

Silk Heritage Thesaurus
type: ConceptScheme