Crepe chiffon
type: Concept
broader: Tabby (silk weave)
preferred label: Espumilla @it
preferred label: Crêpe chiffon (tissu) @fr
top concept of: Silk Heritage Thesaurus
in scheme: Silk Heritage Thesaurus
bibliographic citation: Boucher, Jean-Jacques. Le dictionnaire de la soie: découvrir son histoire de ses origines jusqu’à nos jours. Paris: F. Lanore, 2015, p. 164 @fr
bibliographic citation: Hardouin-Fugier, Élisabeth, Berthod, Bernard, Chavent-Fusaro, Martine et Déprez, Camille. Les étoffes : dictionnaire historique. Paris: l’Amateur (1994), 2005, p. 153 @fr
bibliographic citation: Dávila Corona, Rosa, Duran i Pujol, Montserrat, y García Fernández, Máximo. Diccionario histórico de telas y tejidos castellano-catalán. Salamanca: Junta de Castilla y León, 2004.; «Real Academia Española». Accedido 20 de noviembre de 2018. http://www.rae.es/; Castany Saládrigas, Francisco. Diccionario de tejidos. Etimología, origen, arte, historia y fabricación de los más importantes tejidos clásicos y modernos. Gustavo Gil S.A., 1949.
bibliographic citation: Dávila Corona, Rosa, Duran i Pujol, Montserrat, y García Fernández, Máximo. Diccionario histórico de telas y tejidos castellano-catalán. Salamanca: Junta de Castilla y León, 2004. @es
bibliographic citation: «Real Academia Española». Accedido 20 de noviembre de 2018. http://www.rae.es/ @es
bibliographic citation: Castany Saládrigas, Francisco. Diccionario de tejidos. Etimología, origen, arte, historia y fabricación de los más importantes tejidos clásicos y modernos. Gustavo Gil S.A., 1949. @es
definition: Loc. masc. Etoffe à armure taffetas, légère et transparente, avec une chaîne et une trame en soie grège. @fr
definition: Termine spagnolo senza corrispondenza in italiano che indica un tessuto di seta molto leggero e trasparente con ordito e trama di seta grezza simile alla garza @it
definition: Del dim. de espuma. Tejido liso de seda muy ligero y transparente con urdimbre y trama de seda cruda @es
definition: A term from the French, meaning a plain fabric, transpent with hard solk warp and weft.

Tabby (silk weave)
type: Concept
preferred label: Taffettà (armatura) @it
preferred label: Taffetas (armure) @fr
preferred label: Tafetán (ligamento) @es

tabby
type: Collection
member: Crepe chiffon

techniques
type: Collection
member: tabby

Silk Heritage Thesaurus
type: ConceptScheme