Indumenti civili
type: Concept
preferred label: Civil attire @en
preferred label: Vêtements civils @fr
preferred label: Indumentaria civil @es

Scarpe
type: Concept
bibliographic citation: CNRTL, https://cnrtl.fr/definition/chaussure @fr
bibliographic citation: Simpson, John; Weiner, Edmund (eds). The Oxford English Dictionary. Oxford : Clarendon Press ; Oxford @en
bibliographic citation: Treccani online. Accessed 25 July 2020. http://www.treccani.it//vocabolario/versione.
bibliographic citation: «Art & Architecture Thesaurus (Getty Research Institute)». Accedido 20 de noviembre de 2018. http://www.getty.edu/research/tools/vocabularies/aat/ @es
bibliographic citation: A. Donnanno, Modabolario. Parole e immagini della moda. Dizionario tecnico-creativo. Storia del costume tessuti e tessitura tecniche sartoriali accessori e stilisti, Milano, 2018
bibliographic citation: G. Sergio, Parole di moda. Il "Corriere delle dame" e il lessico della moda nell'Ottocento, Milano, 2010.
bibliographic citation: «Real Academia Española». Accedido 20 de noviembre de 2018. http://www.rae.es/. @es
bibliographic citation: Dictionnaire de l'Académie française, https://www.dictionnaire-academie.fr/article/A9C1834 @fr
alternative label: calzatura
broader: Indumenti civili
definition: n. From the Old English "scóh", "scó" "sceó" the Middle English "sceoh" "shoo" "shooe" and inherited from the Common Germanic. It refers to an outer item to wear on the human foot which could be made from several materials. It consists of a sole and a upper part, commonly covering until the ankle. @en
definition: Calzado con suela y talón relativamente rígidos, y que por lo general cubre el pie hasta la altura del tobillo o por debajo de él. @es
definition: s.f. [forse dal germ. *skarpa «tasca di pelle»]. Calzatura che riveste e protegge il piede, con suole e tacchi relativamente rigidi, di solito coprono il piede fino alla caviglia o sotto la caviglia. E' fatta per lo più di cuoio nella parte sottostante che sta a contatto con il terreno (suola e tacchi), e di pelle, stoffa e sim. in quella sovrastante (tomaia).
definition: Subst. fém. Dér. de chausser. Pièce de l'habillement fabriquée dans une matière souple (tissu, cuir, toile, matières synthétiques) qui sert à couvrir et protéger le pied. @fr
in scheme: Silk Heritage Thesaurus
preferred label: Shoes @en
preferred label: Zapatos @es
preferred label: Chaussure @fr
top concept of: Silk Heritage Thesaurus

Silk Heritage Thesaurus
type: ConceptScheme