Indumenti civili
type: Concept
preferred label: Civil attire @en
preferred label: Vêtements civils @fr
preferred label: Indumentaria civil @es

Indumento femminile
type: Concept
bibliographic citation: Dictionnaire de l'Académie française, https://www.dictionnaire-academie.fr/article/A8V0407. @fr
bibliographic citation: G. Sergio, Parole di moda. Il "Corriere delle dame" e il lessico della moda nell'Ottocento, Milano, 2010.
bibliographic citation: Treccani online. Accessed 25 July 2020. http://www.treccani.it//vocabolario/versione.
bibliographic citation: CNRT, https://cnrtl.fr/definition/v%C3%AAtement? https://cnrtl.fr/definition/f%C3%A9minin @fr
bibliographic citation: A. Donnanno, Modabolario. Parole e immagini della moda. Dizionario tecnico-creativo. Storia del costume tessuti e tessitura tecniche sartoriali accessori e stilisti, Milano, 2018
bibliographic citation: «Art & Architecture Thesaurus (Getty Research Institute)». Accedido 20 de noviembre de 2018. http://www.getty.edu/research/tools/vocabularies/aat/. @es
alternative label: abbigliamento femminile; vestito femminile
alternative label: indumentaria civil femenina @es
alternative label: indumentaria de la mujer @es
broader: Indumenti civili
definition: It refers to the set, evolution and expression of women's clothing along history. It refers to the garments, clothes or accessories designed or used by women. @en
definition: s.m. [dal lat. tardo indumentum «abito, rivestimento», der. di induĕre «vestire, indossare»] vestiti ideati per persone di sesso femminile, possono far parte di un set completo o concepiti singolarmente
definition: Loc. masc. pl. Ensemble des pièces de l'habillement, à l'exclusion des chaussures, servant à couvrir le corps, destinées à être porté par les femmes. @fr
definition: Conjunto, evolución y expresión del vestir de la mujer a lo largo de la historia. Son las prendas de vestir o complementos diseñadas o usadas por mujeres @es
in scheme: Silk Heritage Thesaurus
preferred label: Indumentaria femenina @es
preferred label: Vêtements féminins @fr
preferred label: Women attire @en
top concept of: Silk Heritage Thesaurus

Silk Heritage Thesaurus
type: ConceptScheme