Indumenti civili
type: Concept
preferred label: Civil attire @en
preferred label: Vêtements civils @fr
preferred label: Indumentaria civil @es

Foulard
type: Concept
bibliographic citation: Dictionnaire de l'Académie française, https://www.dictionnaire-academie.fr/article/A9F1388 @fr
bibliographic citation: CNRTL, https://cnrtl.fr/definition/foulard @fr
bibliographic citation: «Art & Architecture Thesaurus (Getty Research Institute)». Accedido 20 de noviembre de 2018. http://www.getty.edu/research/tools/vocabularies/aat/. @es
bibliographic citation: Maria Teresa Lucidi ( a cura di), Glossario dei termini tecnici occidentali, cinesi e giapponesi, in La seta e la sua via, Roma, 1994
bibliographic citation: E. Bianchi, Dizionario internazionale dei tessuti, Como, 1997
bibliographic citation: A. Donnanno, Modabolario. Parole e immagini della moda. Dizionario tecnico-creativo. Storia del costume tessuti e tessitura tecniche sartoriali accessori e stilisti, Milano, 2018
bibliographic citation: F. Pizzato, Tessuti & C. Piccolo dizionario dei termini del mestiere, Milano, 1992
bibliographic citation: Simpson, John; Weiner, Edmund (eds). The Oxford English Dictionary. Oxford : Clarendon Press ; Oxford ; New York : Oxford University Press, 1989. [www.oed.com]; Stevenson, Angus, ed. Oxford Dictionary of English. 3rd ed. Oxford University Press, 2010. @en
bibliographic citation: «Real Academia Española». Accedido 20 de noviembre de 2018. http://www.rae.es/ @es
bibliographic citation: Treccani online. Accessed 20 February 2020. http://www.treccani.it//vocabolario/versione.
bibliographic citation: G. Sergio, Parole di moda. Il "Corriere delle dame" e il lessico della moda nell'Ottocento, Milano, 2010.
alternative label: foulard @es
broader: Indumenti civili
definition: s. m. [etimo incerto]. Tipo di stoffa indiana di seta, caratterizzata dalla fantasia dei disegni e dalla vivacità dei colori o più comunemtente fazzoletto, di seta o d’altro tessuto, da collo (per uomo o per donna) o da testa (per donna)
definition: Del fr. foulard. Tela de seda muy fina, por lo general con dibujos estampados o pañuelo para el cuello, a modo de bufanda. @es
definition: Subst. masc. D'orig. inc. Pièce de tissu carrée, faite d'une étoffe fine et légère en soie ou en coton, nouée autour du cou, ou autour de la tête ou des épaules pour les femmes, et servant comme ornement ou protection contre le froid. @fr
definition: n. From the French "Foulard". A thin and flexible material from silk, or a mixture of silk and cotton. Also an item made of this material, usually to wear around the neck, usually with a printed pattern. @en
in scheme: Silk Heritage Thesaurus
preferred label: Fular @es
related: Q2002752
related match: Q2002752
top concept of: Silk Heritage Thesaurus

Silk Heritage Thesaurus
type: ConceptScheme