Indumenti civili
type: Concept
preferred label: Civil attire @en
preferred label: Vêtements civils @fr
preferred label: Indumentaria civil @es

Giubba
type: Concept
bibliographic citation: F. Pizzato, Tessuti & C. Piccolo dizionario dei termini del mestiere, Milano, 1992
bibliographic citation: E. Bianchi, Dizionario internazionale dei tessuti, Como, 1997
bibliographic citation: Maria Teresa Lucidi ( a cura di), Glossario dei termini tecnici occidentali, cinesi e giapponesi, in La seta e la sua via, Roma, 1994
bibliographic citation: «Art & Architecture Thesaurus (Getty Research Institute)». Accedido 20 de noviembre de 2018. http://www.getty.edu/research/tools/vocabularies/aat/. @es
bibliographic citation: CNRTL, https://cnrtl.fr/definition/pourpoint, Dictionnaire de l'Académie française, https://www.dictionnaire-academie.fr/article/A9P3780 @fr
bibliographic citation: G. Sergio, Parole di moda. Il "Corriere delle dame" e il lessico della moda nell'Ottocento, Milano, 2010.
bibliographic citation: Simpson, John; Weiner, Edmund (eds). The Oxford English Dictionary. Oxford : Clarendon Press ; Oxford ; New York : Oxford University Press, 1989. [www.oed.com]; Stevenson, Angus, ed. Oxford Dictionary of English. 3rd ed. Oxford University Press, 2010. @en
bibliographic citation: A. Donnanno, Modabolario. Parole e immagini della moda. Dizionario tecnico-creativo. Storia del costume tessuti e tessitura tecniche sartoriali accessori e stilisti, Milano, 2018
bibliographic citation: «Real Academia Española». Accedido 20 de noviembre de 2018. http://www.rae.es/ @es
broader: Indumenti civili
definition: Del aum. de juba. Vestidura que cubría desde los hombros hasta la cintura, ceñida y ajustada al cuerpo. Su aparición como parte del traje civil data del siglo XIV, pero su verdadero auge lo alcanzó en el siglo XVI, en que se extendió desde España a toda Europa. Era usado en la Edad Media para ambos sexos, en el siglo XVI se extendió en Europa para uso cortesano. @es
definition: s.f. Dall'arabo giubbah "sottoveste di cotone", indumento che copre dalle spalle alla vita, aderente al corpo.
definition: Subst. masc. Subst. de l’ancien adjectif porpoint "piqué, brodé", lui-même issu de perpunctum, supin du lat. tardif perpungere, "percer en piquant". Vêtement masculin en usage en Europe du XIIIe au XVIIe s., couvrant le torse jusqu'à la ceinture. @fr
definition: n. From the French "doublet" meaning something folded. It is a close-fitting body garment, used in medieval times, as a civil and courtly garment, by men and by women (but rarely named with this term for women's). @en
in scheme: Silk Heritage Thesaurus
preferred label: Pourpoint @fr
preferred label: Jubón @es
preferred label: Doublet @en
top concept of: Silk Heritage Thesaurus

Silk Heritage Thesaurus
type: ConceptScheme