Casula
type: Concept
preferred label: Chasuble @en
preferred label: Casulla @es

Stola
type: Concept
bibliographic citation: A. Donnanno, Modabolario. Parole e immagini della moda. Dizionario tecnico-creativo. Storia del costume tessuti e tessitura tecniche sartoriali accessori e stilisti, Milano, 2018
bibliographic citation: «Real Academia Española». Accedido 20 de noviembre de 2018. http://www.rae.es/ @es
bibliographic citation: Simpson, John; Weiner, Edmund (eds). The Oxford English Dictionary. Oxford : Clarendon Press ; Oxford ; New York : Oxford University Press, 1989. [www.oed.com] @en
bibliographic citation: G. Sergio, Parole di moda. Il "Corriere delle dame" e il lessico della moda nell'Ottocento, Milano, 2010.
bibliographic citation: Joël Perrin, Sandra Vasco Rocca, Caisse nationale des monuments historiques et des sites (France), Istituto centrale per il catalogo e la documentazione (Italie) Editions du Patrimoine, Thesaurus des objets religieux : meubles, objets, linges, vêtements et instruments de musique du culte catholique romain, Paris, Editions du Patrimoine, 1999 @fr
bibliographic citation: Dictionnaire de l'Académie française, https://www.dictionnaire-academie.fr/article/A9E2942 @fr
bibliographic citation: Eglise catholique en France, Glossaire, https://eglise.catholique.fr/glossaire/etole/. @fr
bibliographic citation: Maria Teresa Lucidi ( a cura di), Glossario dei termini tecnici occidentali, cinesi e giapponesi, in La seta e la sua via, Roma, 1994
bibliographic citation: «Art & Architecture Thesaurus (Getty Research Institute)». Accedido 20 de noviembre de 2018. http://www.getty.edu/research/tools/vocabularies/aat/. @es
bibliographic citation: F. Pizzato, Tessuti & C. Piccolo dizionario dei termini del mestiere, Milano, 1992
bibliographic citation: E. Bianchi, Dizionario internazionale dei tessuti, Como, 1997
broad match: Q4342445
broader: Casula
broader: Q4342445
definition: Del lat. stola, y este del gr. στολή stolḗ 'vestido'. Ornamento sagrado que consiste en una banda de tela de dos metros aproximadamente de largo y unos siete centímetros de ancho, con tres cruces, una en el medio y otra en cada extremo, los cuales se ensanchan gradualmente hasta medir en los bordes doce centímetros. @es
definition: Subst. fém. Du du gr. stolê, par l'interm. du lat. stola "habillement, robe". L'étole est une longue bande d'étoffe portée autour du cou par les prêtres et les évêques, ou en biais par les diacres, sur l'aube ou le surplis pendant la messe ou lors de l'administration du sacrement. Elle est de la même couleur que la chasuble ou la dalmatique. @fr
definition: n. From the Latin "stola". A liturgical vestment in the shape of a narrow strip, generally of silk or linen, worn by priests or deacons during ceremonies. The way it is worn differs from the priest (over the shoulders) than from deacons (over the left shoulder only and hanging down to the knee or lower). @en
definition: s.f. Der lat. stola, e dal gr. στολή stolḗ 'vestito'. Insegna liturgica utilizzata dai diaconi, dai presbiteri e dai vescovi della Chiesa cattolica e di altre comunità cristiane di tradizione occidentale. La stola è costituita da una striscia di stoffa lunga tra i 200 e i 250 centimetri ed è ornata generalmente con tre croci, una a ciascuna estremità ed una al centro; la stola può essere più o meno decorata con ricami e il suo colore varia a seconda del tempo liturgico. Il diacono la indossa sulla spalla sinistra e legata al fianco destro; il sacerdote la indossa intorno al collo.
in scheme: Silk Heritage Thesaurus
preferred label: Estola @es
preferred label: Étole @fr
preferred label: Stole @en
top concept of: Silk Heritage Thesaurus

Silk Heritage Thesaurus
type: ConceptScheme