Attire
type: Concept
preferred label: Indumentaria @es
preferred label: Vêtement @fr
preferred label: Abbigliamento @it

Religious attire
type: Concept
bibliographic citation: A. Donnanno, Modabolario. Parole e immagini della moda. Dizionario tecnico-creativo. Storia del costume tessuti e tessitura tecniche sartoriali accessori e stilisti, Milano, 2018 @it
bibliographic citation: Agredo Pino, Ana María. ‘Indumentaria Religiosa’ 17 (2011): 107–28 @es
bibliographic citation: Maria Teresa Lucidi ( a cura di), Glossario dei termini tecnici occidentali, cinesi e giapponesi, in La seta e la sua via, Roma, 1994 @it
bibliographic citation: G. Sergio, Parole di moda. Il "Corriere delle dame" e il lessico della moda nell'Ottocento, Milano, 2010. @it
bibliographic citation: Louis Trichet, Le costume du clergé. Ses origines et son évolution en France d'après les règlements de l'Eglise, Paris, Editions du Cerf, 1986 @fr
bibliographic citation: F. Pizzato, Tessuti & C. Piccolo dizionario dei termini del mestiere, Milano, 1992 @it
bibliographic citation: E. Bianchi, Dizionario internazionale dei tessuti, Como, 1997 @it
bibliographic citation: «Real Academia Española». Accedido 20 de noviembre de 2018. http://www.rae.es/. @es
bibliographic citation: Simpson, John; Weiner, Edmund (eds). The Oxford English Dictionary. Oxford : Clarendon Press ; Oxford ; New York : Oxford University Press, 1989. [www.oed.com]
alternative label: vestimenta religiosa @es
alternative label: liturgical attire
alternative label: ecclesiastical clothing
alternative label: ecclesiastical garments
alternative label: vestidura litúrgica @es
alternative label: church vestment
alternative label: vestidura religiosa @es
alternative label: ecclesiastical costume
alternative label: vestidura de iglesia @es
alternative label: church costume
broader: Attire
definition: s.f. pl. Indumenti usati nei riti religiosi. Questi possono essere di diversa tipologia secondo l'uso e di foggia sartoriale più o meno ricca. Quelli utilizzati dai membri del clero al di fuori dei riti sono detti abiti acclesiastici; quelli utilizzati durante le celebrazioni sono detti insegne liturgiche o paramenti sacri; mentre gli abiti religiosi, come la tunica, il saio o la cocolla contraddistinguono i membri di un determinato ordine religioso. @it
definition: Conjunto de vestiduras y ornamentos con los que deben revestirse los ministerios de distintas confesiones religiosas para ejercer sus deberes litúrgicos. En algunas religiones permite distinguir la jerarquía de los miembros del clero. La indumentaria religiosa también se aplica a aquellos vestidos o elementos que en ocasiones concretas portan los fieles o las imágenes religiosas. @es
definition: Loc. masc. Le costume ecclésiastique est l'appellation sous laquelle on rassemble les pièces de l'habillement portées par les hommes et les femmes qui ont prononcé des voeux de religion, ou qui relèvent d'une institution religieuse. Ces vêtements peuvent être portés durant l'activité quotidienne du personnel religieux, ou lors des célébrations religieuses. Ils se distinguent par leur coupe, leur forme, leur couleur et leur usage, marquant notamment des différences de statut, d'apartenance (à un ordre religieux) ou de genre. @fr
definition: It refers to any dressing or textile apparels which are used in religious and liturgical contexts.
in scheme: Silk Heritage Thesaurus
narrower: Mantle (religious)
narrower: Samples
narrower: Ternum
narrower: Humeral veil
narrower: Chasuble
narrower: Clerical colar
narrower: Christening gown
preferred label: Indumentaria religiosa @es
preferred label: Vesti religiose @it
preferred label: Costume écclésiastique @fr
top concept of: Silk Heritage Thesaurus

Chasuble
type: Concept
preferred label: Casula @it
preferred label: Casulla @es

Ternum
type: Concept
preferred label: Terno @it
preferred label: Ornement liturgique @fr

Clerical colar
type: Concept
preferred label: Col romain @fr
preferred label: Collarino @it
preferred label: Collarín @es

Samples
type: Concept
preferred label: Muestrario @es
preferred label: Campionario @it
preferred label: Echantillon @fr

Christening gown
type: Concept
preferred label: Veste battesimale @it
preferred label: Faldón @es
preferred label: Robe de baptême @fr

Mantle (religious)
type: Concept
preferred label: Manteau (iconographie) @fr
preferred label: Manto (religioso) @es

Humeral veil
type: Concept
preferred label: Voile huméral @fr
preferred label: Humeral @es
preferred label: omerale @it

Silk Heritage Thesaurus
type: ConceptScheme