Raso irregolare
type: Concept
preferred label: Satin irrégulier @fr
preferred label: Irregular satin @en
preferred label: Raso irregular @es

Raso regina
type: Concept
bibliographic citation: G. Sergio, Parole di moda. Il "Corriere delle dame" e il lessico della moda nell'Ottocento, Milano, 2010.
bibliographic citation: Burnham, Dorothy. Warp and Weft. A Textile Terminology. Royal Ontario Museum, 1980. @en
bibliographic citation: Castany Saládrigas, Francisco. Diccionario de tejidos. Etimología, origen, arte, historia y fabricación de los más importantes tejidos clásicos y modernos. Gustavo Gil S.A., 1949 @es
bibliographic citation: Blanxart y Pedrals, Daniel. La Industria Textil. Barcelona: Imp. A. Ortega, 1946. @es
bibliographic citation: Boucher, Jean-Jacques. Le dictionnaire de la soie: découvrir son histoire de ses origines jusqu’à nos jours. Paris: F. Lanore, 2015, p. 528 @fr
bibliographic citation: F. Pizzato, Tessuti & C. Piccolo dizionario dei termini del mestiere, Milano, 1992
bibliographic citation: E. Bianchi, Dizionario internazionale dei tessuti, Como, 1997
bibliographic citation: Peyot, F., Cours complet de fabrique pour les étoffes de soie, Lyon: Perrin,1866, p. 18 @fr
bibliographic citation: Bezon, Jean. Dictionnaire général des tissus anciens et modernes.‎ Tome 1. ‎ Lyon : Th . Lepagnez, 1859, p. 203 @fr
bibliographic citation: Casa Aruta, Francisco. Diccionario de la industria textil. Barcelona: Labor, 1969 @es
bibliographic citation: A. Donnanno, Modabolario. Parole e immagini della moda. Dizionario tecnico-creativo. Storia del costume tessuti e tessitura tecniche sartoriali accessori e stilisti, Milano, 2018
bibliographic citation: Algoud, Henri. Grammaire des arts de la soie. Paris: Jean Schemit, 1912, p. 48 @fr
bibliographic citation: Giner Bressó, Ramón. Escuela Textil del Colegio del Arte Mayor de la Seda de Valencia. Apuntes de tecnología textil. València: Generalitat Valenciana, 1998 @es
bibliographic citation: Maria Teresa Lucidi ( a cura di), Glossario dei termini tecnici occidentali, cinesi e giapponesi, in La seta e la sua via, Roma, 1994
broader: Raso irregolare
definition: s.m. Tessuto di seta con un legamento di raso irregolare di 6. Ampiamente usato come base per la distribuzione di motivi nelle composizioni di disegni jacquard.
definition: Tejido de seda con ligamento en raso irregular de seis. Muy utilizado como base de la distribución de motivos en las composiciones de dibujos jacquard. @es
definition: Loc.masc. Satin de 6 avec interruption 1, 2 ,3 ,3 ,2 ,1. C'est un satin dit "irrégulier". @fr
definition: n. The term is used in Spanish, referring to a type of irregular silk cloth of six interlaces. @en
in scheme: Silk Heritage Thesaurus
preferred label: Queen satin @en
preferred label: Raso reina @es
preferred label: Satin à la reine (armure) @fr
top concept of: Silk Heritage Thesaurus

satin
type: Collection
member: Raso regina

techniques
type: Collection
member: satin

Silk Heritage Thesaurus
type: ConceptScheme