Ordito
type: Concept
preferred label: Warp (yarn) @en
preferred label: Chaîne @fr
preferred label: Urdimbre @es

Ordito base
type: Concept
bibliographic citation: Benito, Pilar. Paraísos de seda. Tejidos y bordados de las casas del Príncipe en los Reales Sitios de El Pardo y El Escorial. València: Universitat de València, 2015 @es
bibliographic citation: A. Donnanno, Modabolario. Parole e immagini della moda. Dizionario tecnico-creativo. Storia del costume tessuti e tessitura tecniche sartoriali accessori e stilisti, Milano, 2018
bibliographic citation: Baum, Maggy et Boyeldieu, Chantal. Dictionnaire encyclopédique des textiles. Paris: Eyrolles, 2018, p. 113 @fr
bibliographic citation: G. Sergio, Parole di moda. Il "Corriere delle dame" e il lessico della moda nell'Ottocento, Milano, 2010.
bibliographic citation: Carbonell, Antonio, trans. Encyclopedia Metòdica: Fábricas, Artes y Oficios, 1: Fàbricas, Artes y Oficios, Traducidos Del Francés Al Castellano. Imp. de Sancha, 1794. @es
bibliographic citation: E. Bianchi, Dizionario internazionale dei tessuti, Como, 1997
bibliographic citation: CIETA. vocabulario Técnico Tejidos Español, francés, inglés, italiano. Lyon: Centre International d’Etude des Textiles Anciens, 1963 @es
bibliographic citation: F. Pizzato, Tessuti & C. Piccolo dizionario dei termini del mestiere, Milano, 1992
bibliographic citation: CIETA. Vocabulaire français. Lyon: Centre International d’Etude des Textiles Anciens, 1997, p. 6 @fr
bibliographic citation: Burnham, Dorothy. Warp and Weft. A Textile Terminology. Royal Ontario Museum, 1980. @en
bibliographic citation: CIETA Vocabolario tecnico dei tessuti Italiano - Francese - Inglese. Lyon: Centre International d’Etude des Textiles Anciens, 2019
bibliographic citation: Maria Teresa Lucidi ( a cura di), Glossario dei termini tecnici occidentali, cinesi e giapponesi, in La seta e la sua via, Roma, 1994
alternative label: Chaîne de fond @fr
broader: Ordito
definition: Loc. fém. Chaine principale dans les tissus à chaînes multiples. Chaîne formant l'armure de fond dans les velours @fr
definition: Urdimbre principal de un tejido y que por lo tanto forma la estructura de base del mismo. En los tejidos labrados, forma los efectos del dibujo y del fondo a la vez. @es
definition: It refers to the main or principal or only warp in a textile. @en
definition: s.m. Ordito principale, in un tessuto che ne prevede più di uno.
in scheme: Silk Heritage Thesaurus
preferred label: Urdimbre base @es
preferred label: Chaîne pièce @fr
preferred label: Main warp @en
top concept of: Silk Heritage Thesaurus

Silk Heritage Thesaurus
type: ConceptScheme