Soie du Bombyx du mûrier
type: Concept
preferred label: Seda bombyx mori @es
preferred label: Seta @it
preferred label: Silk bombyx mori @en

Sériciculture
type: Concept
bibliographic citation: « Centre National de Ressources Textuelles et Lexicales », https://cnrtl.fr/definition/s%C3%A9riciculture
bibliographic citation: Clavairolle Françoise. L'Éducation des vers à soie : savoirs, représentations, techniques. In: L'Homme, 1994, 34, n°129. p. 121-145
bibliographic citation: F. Pizzato, Tessuti & C. Piccolo dizionario dei termini del mestiere, Milano, 1992 @it
bibliographic citation: «Real Academia Española». Accedido 20 de noviembre de 2018. http://www.rae.es/ @es
bibliographic citation: Vieil, Pierre. Sériciculture. Paris: J.-B. Baillière et fils, 1920
bibliographic citation: Maria Teresa Lucidi ( a cura di), Glossario dei termini tecnici occidentali, cinesi e giapponesi, in La seta e la sua via, Roma, 1994 @it
bibliographic citation: G. Sergio, Parole di moda. Il "Corriere delle dame" e il lessico della moda nell'Ottocento, Milano, 2010. @it
bibliographic citation: Benito, P. Paraísos de seda. Tejidos y bordados de las casas del Príncipe en los Reales Sitios de El Pardo y El Escorial. València: Universitat de València, 2015 @es
bibliographic citation: CIETA, Guelton, Marie-Hélène et Valansot, Odile (dir.). Vocabulaire technique français Lyon: Centre international d’étude des textiles anciens, 2020, p. 44
bibliographic citation: «Art & Architecture Thesaurus (Getty Research Institute)». Accedido 20 de noviembre de 2018. http://www.getty.edu/research/tools/vocabularies/aat/. @es
bibliographic citation: CIETA. vocabulario Técnico Tejidos Español, francés, inglés, italiano. Lyon: Centre International d’Etude des Textiles Anciens, 1963 @es
bibliographic citation: E. Bianchi, Dizionario internazionale dei tessuti, Como, 1997 @it
bibliographic citation: Pariset, Ernest. Les industries de la soie, sériciculture, filature, moulinage, tissage, teinture. Histoire et statistique, Lyon: Pitrat aîné, 1862, p. 2
bibliographic citation: Burnham, Dorothy. Warp and Weft. A Textile Terminology. Royal Ontario Museum, 1980; Simpson, John; Weiner, Edmund (eds). The Oxford English Dictionary. Oxford : Clarendon Press ; Oxford ; New York : Oxford University Press, 1989. [www.oed.com] @en
bibliographic citation: Aniello Gentile, Dizionario etimologico dell'arte tessile, Napoli, 1981 @it
bibliographic citation: A. Donnanno, Modabolario. Parole e immagini della moda. Dizionario tecnico-creativo. Storia del costume tessuti e tessitura tecniche sartoriali accessori e stilisti, Milano, 2018 @it
alternative label: sericultura @es
alternative label: Éducation des vers à soie
broader: http://vocab.getty.edu/aat/300254388
definition: n. Apparently a borrowing from the French "sériculture". It is the action of cultivate silkworms, the related plants to feed them and the processing of cocoons, in order to produce silk. @en
definition: Del lat. serĭcum 'seda' y -cultura. Industria de la cría y producción de capullos de seda. @es
definition: s.f.Industria della seta e tutte quelle operazioni connesse per la produzione del filato, dall'allevamento del baco da seta alle operazioni in filanda. @it
definition: Subst. fém. Dér. du lat. sericum, "soie". Industrie de l'élevage et de la production de cocons de soie, qui a pour but de produire de la soie. En France, sans doute en raison du caractère prestigieux de cette fibre, on disait l'"éducation" des vers à soie. Elle comprend la culture des plantes dont se nourrissent les chenilles et l'élevage de l'insecte depuis l'œuf d’où sort la chenille, jusqu'au cocon.
in scheme: Silk Heritage Thesaurus
preferred label: Sericoltura @it
preferred label: Sericulture @en
preferred label: Sericicultura @es
related: Soie du Bombyx du mûrier
top concept of: Silk Heritage Thesaurus

Silk Heritage Thesaurus
type: ConceptScheme