Buratto
type: Concept
preferred label: Buratine @en
preferred label: Buratine (tissu) @fr
preferred label: Buratina @es

Taffettà (armatura)
type: Concept
preferred label: Tabby (silk weave) @en
preferred label: Taffetas (armure) @fr
preferred label: Tafetán (ligamento) @es

Mussola
type: Concept
bibliographic citation: A. Donnanno, Modabolario. Parole e immagini della moda. Dizionario tecnico-creativo. Storia del costume tessuti e tessitura tecniche sartoriali accessori e stilisti, Milano, 2018
bibliographic citation: F. Pizzato, Tessuti & C. Piccolo dizionario dei termini del mestiere, Milano, 1992
bibliographic citation: «Real Academia Española». Accedido 20 de noviembre de 2018. http://www.rae.es/. @es
bibliographic citation: Hardouin-Fugier, Élisabeth, Berthod, Bernard, Chavent-Fusaro, Martine et Déprez, Camille. Les étoffes : dictionnaire historique. Paris: l’Amateur, 1994, p. 272 @fr
bibliographic citation: E. Bianchi, Dizionario internazionale dei tessuti, Como, 1997
bibliographic citation: Falcot, Pierre. Traité encyclopédique et méthodique de la fabrication des tissus. Tome 1, Elbeuf: l’auteur, Mulhouse: Risler, 1852, p. 126 @fr
bibliographic citation: Maria Teresa Lucidi ( a cura di), Glossario dei termini tecnici occidentali, cinesi e giapponesi, in La seta e la sua via, Roma, 1994
bibliographic citation: G. Sergio, Parole di moda. Il "Corriere delle dame" e il lessico della moda nell'Ottocento, Milano, 2010.
bibliographic citation: Aniello Gentile, Dizionario etimologico dell'arte tessile, Napoli, 1981
bibliographic citation: Castany Saládrigas, Francisco. Diccionario de tejidos. Etimología, origen, arte, historia y fabricación de los más importantes tejidos clásicos y modernos. Gustavo Gil S.A., 1949 @es
bibliographic citation: Segal, William. Encyclopedia of Textiles. New Jersey: Prentice Hall, 1972; The American Silk Journal. A Dictionary of Silk Terms. New York: Clifford & Lawton, 1915; Tortora, Phyllis, y Ingrid Johnson. The Fairchild Books Dictionary of Textiles, 2014. Simpson, John; Weiner, Edmund (eds). The Oxford English Dictionary. Oxford : Clarendon Press ; Oxford ; New York : Oxford University Press, 1989. [www.oed.com] @en
bibliographic citation: Algoud, Henri, Grammaire des arts de la soie, Paris: Jean Schemit, 1912, p. 63-64 @fr
bibliographic citation: Dávila Corona, R,osa Duran i Pujol, Montserrat, y García Fernández, Máximo. Diccionario histórico de telas y tejidos castellano-catalán. Salamanca: Junta de Castilla y León, 2004 @es
alternative label: mussolina
broader: Taffettà (armatura)
definition: Subst. fém. Depuis l'Antiquité, le nom de mousseline est donné à un tissu à armure toile entièrement en coton, avec une chaîne et une trame en fils retors à haute torsion. On trouve aussi des mousselines de laine. La mousseline de soie est un taffetas qui varie de réduction suivant la qualité des matières. C'est une des formes de la gaze droite. @fr
definition: Del fr. mousseline. Tela de algodón, lana o seda fina, ligera y poco tupida. Su origen se remonta a los tejidos fabricados en la ciudad mesopotámica de Mosul. Tejido de hilo muy fino y ligero, tanto en la urdimbre como en la trama, con ligamento tafetán con una densidad muy pequeña y presentado el aspecto transparente de la gasa. @es
definition: s.f. Lat. mediev. musolum. Dall'ar. Mossul, nome della famosa città della Mesopotamia. Tipo di tessuto morbido e leggerissimo, in tela di cotone, lana o seta, formato da filati fini sia in ordito che in trama, importato in Inghilterra nel XVII sec. dal Medio Oriente. Detto anche mosal. Anche it. tela mussolina, il fr. mousseline; fr. a. mosulin (XIII sec.) forse dal veneziano; anche l'ingl. mussolin (muslin, 1609) .
definition: n. A term borrowed from the French "mousseline". From previous forms as "mossuline" "muscelin" "muslina" "muzlin". It refers to the various lightweight cotton, cotton blend or silk fabrics in a plain weave, from the most lightweight sheers to the heavyweight sheetings. Its origins are in the city of Mosul, antique Mesopotamia, now Iraq. Most common uses are underwear, linings, shirtings, sheets, pillow cases or furniture coverings. @en
in scheme: Silk Heritage Thesaurus
narrower: Mussolina tornasole
preferred label: Muselina @es
preferred label: Muslin @en
preferred label: Mousseline (tissu) @fr
related: Lana
related: Buratto
related: Q725457
related match: Q725457
top concept of: Silk Heritage Thesaurus

Mussolina tornasole
type: Concept
preferred label: Muselina tornasol @es
preferred label: Tornasol muslin @en
preferred label: Mousseline tournesol (tissu) @fr

Lana
type: Concept
preferred label: Laine @fr
preferred label: Wool @en

tabby
type: Collection
member: Mussola

techniques
type: Collection
member: tabby

Silk Heritage Thesaurus
type: ConceptScheme