Cannetille (thread)
type: Concept
bibliographic citation: ‘Dictionary by Merriam-Webster: America’s Most-Trusted Online Dictionary’. Accessed 13 January 2020. https://www.merriam-webster.com/.; Campbell, Gordon. The Oxford Dictionary of the Renaissance. Oxford University Press, 2003. @en
bibliographic citation: Benito, Pilar. Paraísos de seda. Tejidos y bordados de las casas del Príncipe en los Reales Sitios de El Pardo y El Escorial. València: Universitat de València, 2015 @es
bibliographic citation: A. Donnanno, Modabolario. Parole e immagini della moda. Dizionario tecnico-creativo. Storia del costume tessuti e tessitura tecniche sartoriali accessori e stilisti, Milano, 2018
bibliographic citation: F. Pizzato, Tessuti & C. Piccolo dizionario dei termini del mestiere, Milano, 1992
bibliographic citation: E. Bianchi, Dizionario internazionale dei tessuti, Como, 1997
bibliographic citation: Carbonell, Antonio, trans. Encyclopedia Metòdica: Fábricas, Artes y Oficios, 2: Fàbricas, Artes y Oficios, Traducidos Del Francés Al Castellano. Imp. de Sancha, 1794. @es
bibliographic citation: G. Sergio, Parole di moda. Il "Corriere delle dame" e il lessico della moda nell'Ottocento, Milano, 2010.
bibliographic citation: Maria Teresa Lucidi ( a cura di), Glossario dei termini tecnici occidentali, cinesi e giapponesi, in La seta e la sua via, Roma, 1994
bibliographic citation: «Real Academia Española». Accedido 20 de noviembre de 2018. http://www.rae.es/ @es
broader: Oro / Argento tirato
definition: Hilo extremadamente fino, metálico, enrollado formando una espiral a modo de muelle hueco que se fija pasando la aguja por su interior. @es
definition: n. It refers a fine gold or silver thread twisted spirally that is used in embroidery and often made into lace for vestments or into military braid @en
definition: s.m. Filo metallico dorato o argentato strettamente avvolto a spirale per frange e altri ornamenti
in scheme: Silk Heritage Thesaurus
preferred label: Cannetille @fr
preferred label: s.m. Filo metallico dorato o argentato strettamente avvolto a spirale per frange e altri ornamenti. Strisciolina d'oro o d'argento tirati o lamellari, attorcigliati a spirale, che viene utilizzata nei ricami
preferred label: Hilo canutillo @es
top concept of: Silk Heritage Thesaurus

Oro / Argento tirato
type: Concept
preferred label: Fil métallique @fr
preferred label: Metal thread @en
preferred label: Hilo metálico @es

Silk Heritage Thesaurus
type: ConceptScheme