Cannetta (tessuto)
type: Concept
bibliographic citation: Peyot, F., Cours complet de fabrique pour les étoffes de soie, Lyon: Perrin,1866, p. 12 @fr
bibliographic citation: Castany Saládrigas, Francisco. Diccionario de tejidos. Etimología, origen, arte, historia y fabricación de los más importantes tejidos clásicos y modernos. Gustavo Gil S.A., 1949 @es
bibliographic citation: F. Pizzato, Tessuti & C. Piccolo dizionario dei termini del mestiere, Milano, 1992
bibliographic citation: E. Bianchi, Dizionario internazionale dei tessuti, Como, 1997
bibliographic citation: Burnham, Dorothy. Warp and Weft. A Textile Terminology. Royal Ontario Museum, 1980. @es
bibliographic citation: Burnham, Dorothy. Warp and Weft. A Textile Terminology. Royal Ontario Museum, 1980; Simpson, John; Weiner, Edmund (eds); The Oxford English Dictionary. Oxford : Clarendon Press; Oxford; New York: Oxford University Press, 1989 [www.oed.com]; Tortora, Phyllis, y Ingrid Johnson. The Fairchild Books Dictionary of Textiles, 2015 @en
bibliographic citation: Treccani online. Accessed 12 February 2019. http://www.treccani.it//vocabolario/versione
bibliographic citation: CIETA. vocabulario Técnico Tejidos Español, francés, inglés, italiano. Lyon: Centre International d’Etude des Textiles Anciens, 1963 @es
bibliographic citation: G. Sergio, Parole di moda. Il "Corriere delle dame" e il lessico della moda nell'Ottocento, Milano, 2010.
bibliographic citation: Villard, Claude. Manuel de théorie du tissage, Tome I, Lyon: A. Rey, 1948, p. 179- 80 @fr
bibliographic citation: A. Donnanno, Modabolario. Parole e immagini della moda. Dizionario tecnico-creativo. Storia del costume tessuti e tessitura tecniche sartoriali accessori e stilisti, Milano, 2018
bibliographic citation: Maria Teresa Lucidi ( a cura di), Glossario dei termini tecnici occidentali, cinesi e giapponesi, in La seta e la sua via, Roma, 1994
bibliographic citation: CIETA, Guelton, Marie-Hélène et Valansot, Odile (dir.). Vocabulaire technique français Lyon: Centre international d’étude des textiles anciens, 2020, p. 5 @fr
alternative label: cannetè
broader: Tecnica di tessitura
definition: Subst. masc. Le cannetillé est le tissu réalisé avec l'armure du même nom. Cette soierie utilisée dans l'ameublement présente souvent une répétition d'un petit dessin géométrique. @fr
definition: s.m. Tessuto la cui caratteristica è la formazione di coste verticali o delle onde nella direzione dell'ordito, solitamente costituito da un solo ordito e una trama.
definition: A term formed within English, by derivation. It is a term used, generally, to identify and describe textiles with marked ribs widthwise, parallels to the filling. @en
definition: De canuto e -illo. Tejido cuya característica es la formación de un cordón o canal en el sentido de la urdimbre, constituido generalmente por una sola trama y una sola urdimbre. @es
in scheme: Silk Heritage Thesaurus
preferred label: Canutillo (tejido) @es
preferred label: Canutillo @en
preferred label: Cannetillé (tissu) @fr
top concept of: Silk Heritage Thesaurus

Tecnica di tessitura
type: Concept
preferred label: Technique de tissage (technique) @fr
preferred label: Técnica de tejido @es
preferred label: Weaving techniques @en

Silk Heritage Thesaurus
type: ConceptScheme