Broccato di tre altezze
type: Concept
bibliographic citation: G. Sergio, Parole di moda. Il "Corriere delle dame" e il lessico della moda nell'Ottocento, Milano, 2010.
bibliographic citation: «Diccionario de Autoridades(1726-1739)». Accedido 20 de noviembre de 2018. http://web.frl.es/DA.html @es
bibliographic citation: Maria Teresa Lucidi ( a cura di), Glossario dei termini tecnici occidentali, cinesi e giapponesi, in La seta e la sua via, Roma, 1994
bibliographic citation: E. Bianchi, Dizionario internazionale dei tessuti, Como, 1997
bibliographic citation: «Real Academia Española». Accedido 20 de noviembre de 2018. http://www.rae.es/ @es
bibliographic citation: F. Pizzato, Tessuti & C. Piccolo dizionario dei termini del mestiere, Milano, 1992
bibliographic citation: Dávila Corona, Rosa, Duran i Pujol, Montserrat, y García Fernández, Máximo. Diccionario histórico de telas y tejidos castellano-catalán. Salamanca: Junta de Castilla y León, 2004 @es
bibliographic citation: Castany Saládrigas, Francisco. Diccionario de tejidos. Etimología, origen, arte, historia y fabricación de los más importantes tejidos clásicos y modernos. Gustavo Gil S.A., 1949 @es
bibliographic citation: A. Donnanno, Modabolario. Parole e immagini della moda. Dizionario tecnico-creativo. Storia del costume tessuti e tessitura tecniche sartoriali accessori e stilisti, Milano, 2018
broader: Velluto
definition: Tela de seda con tres órdenes: fondo, labor y sobre ésta un escarchado de anillejos muy pequeños; igual que el rizo del terciopelo. Sobre el fondo se realizaba el hilo de plata u oro, o la seda briscada en flores y dibujos. @es
definition: Silk fabric with three heights: ground, brocade and on it an uncut velvet. On the ground the silver or gold thread were made, or the silk briscado thread in flowers and drawings. @en
definition: Appellation ancienne, usuelle et imprécise. Le mot brocart désigne un velours broché. Il s'agit sans doute d'un velours relevé. @fr
definition: s.m. Tessuto di seta con tre ordini: fondo, decoro e su questo una distesa di anelli molto piccoli; proprio come il velluto riccio. Sullo sfondo veniva utilizzato il filo d'argento o d'oro, per realizzare fiori e disegni
in scheme: Silk Heritage Thesaurus
preferred label: Brocado de tres altos @es
preferred label: Velours brocart à trois hauteurs @fr
preferred label: Three heights of pile brocade @en
top concept of: Silk Heritage Thesaurus

Velluto
type: Concept
preferred label: Velvet @en
preferred label: Terciopelo @es
preferred label: Velours (armure) @fr

techniques
type: Collection
member: velvet

velvet
type: Collection
member: Broccato di tre altezze

Silk Heritage Thesaurus
type: ConceptScheme